ArcEmu: snake87401 - Viewing Profile - ArcEmu

Jump to content

Toggle shoutbox Lastest Announcements

dfighter  : (01 January 2013 - 05:56 PM) Arcemu wishes you all a happy new year!
Hasbro  : (12 September 2012 - 10:01 AM) Please excuse our outage from the web! Our web host had a major malfunction!
dfighter  : (01 September 2012 - 04:05 PM) Since the spam bots just don't want to stop, I've enabled admin verification when registering.
dfighter  : (23 January 2012 - 09:56 PM) Please note that from now on you will need to confirm your email on the wiki in order to edit it!
Hasbro  : (31 December 2011 - 12:50 PM) Happy New Years all!
Navid  : (26 December 2011 - 04:09 AM) Merry Christmas !!!!!! Happy holidays all :)
WAmadeus  : (24 December 2011 - 03:54 PM) Merry Christmas to all!
dfighter  : (24 December 2011 - 11:05 AM) The Arcemu team wishes y'all a Merry Christmukkah!
Hasbro  : (05 October 2011 - 12:53 PM) Looking for web designers for upcoming web related project. If you're interested in designing user interfaces contact me
dfighter  : (02 September 2011 - 03:47 PM) So who here wants vehicles in Arcemu? :P http://arcemu.org/fo...showtopic=25440
Hasbro  : (14 August 2011 - 03:25 PM) Join us on irc, grab an irc client and connect to irc.freenode.net join channel #arcemu /server irc.freenode.net:6667 /join #arcemu
jackpoz  : (03 August 2011 - 05:33 AM) to all Lua Engine (old one) users: please check http://arcemu.org/fo...showtopic=25274
Hasbro  : (20 May 2011 - 05:27 PM) Looking for people experienced with CMake configuration and setup! Contact me asap
Hasbro  : (15 May 2011 - 05:03 PM) ArcEmu is recruiting C++ programmers, contact Hasbro if interested.
paroxysm  : (03 May 2011 - 06:26 PM) Updated luabridge gossip example to describe the whole gossip creation process rather than just how to create menu. Gossip tutorial
paroxysm  : (23 April 2011 - 11:35 AM) Lua writers can refer to the Luabridge Tutorials section in the Wiki to learn how to write gossip code correctly.
Hasbro  : (20 April 2011 - 05:22 PM) Thank you for your continuous contribution of bug reports, we are working on them.
Hasbro  : (17 April 2011 - 03:20 AM) Please consider donating to support our bills. Donations can be sent using PayPal to donations@arcemu.org - Thank you for your support.
paroxysm  : (10 April 2011 - 12:43 AM) Refer to the Luabridge Tutorials section in the Wiki to learn the new syntax of luabridge.
Hasbro  : (06 April 2011 - 07:55 PM) We will not tolerate disrespect on our forums. If you believe a member of the staff or a member of the community is abusing our forums, please report their post.
Resize Shouts Area

snake87401's Profile User Rating: -----

Group:
Members
Active Posts:
86 (0.04 per day)
Most Active In:
General Chat (60 posts)
Joined:
21-December 08
Profile Views:
1,891
Last Active:
User is offline Mar 17 2014 07:55 AM
Currently:
Offline

My Information

Member Title:
Member
Age:
29 years old
Birthday:
November 1, 1984
Gender:
Male Male
Interests:
im interested in computer programming/gfx

Contact Information

E-mail:
Private
MSN:
MSN  snake87401@live.com
Yahoo:
Yahoo  snake87401@yahoo.com

Latest Visitors

  • Photo Chuki 
    04 Nov 2013 - 22:42
  • Photo Guest
    14 Jun 2012 - 12:16
  • Photo Ikean 
    29 Jan 2011 - 12:36
  • Photo godstarxxx 
    27 Jan 2011 - 10:22
  • Photo Fasthio 
    23 Jan 2011 - 03:53

Topics I've Started

  1. Need Help With Making Custom Mounts

    04 November 2013 - 09:45 PM

    well im here trying to make a custom mount from scratch sorda
    i know its like item targets spell add creature to pets>mounts
    and i know i have to make a spell for the mount to work in the dbc but i need to know how to get it to target that custom spell first

    right now im using the Swift Spectral Tiger sql for the base of the sql entry but a whole new entry targeting the Loque'nahak

    heres what i have

    INSERT INTO `creature_names` (`entry`, `name`, `subname`, `info_str`, `flags1`, `type`, `family`, `rank`, `killcredit1`, `killcredit2`, `male_displayid`, `female_displayid`, `male_displayid2`, `female_displayid2`, `unknown_float1`, `unknown_float2`, `leader`, `questitem1`, `questitem2`, `questitem3`, `questitem4`, `questitem5`, `questitem6`, `waypointid`) VALUES (300000, 'DCD Welcome Mount', '', '', 0, 1, 0, 0, 0, 0, 28010, 0, 0, 0, 1, 1, 0, 0, 0, 0, 0, 0, 0, 0);


    INSERT INTO `creature_proto` (`entry`, `minlevel`, `maxlevel`, `faction`, `minhealth`, `maxhealth`, `mana`, `scale`, `npcflags`, `attacktime`, `attacktype`, `mindamage`, `maxdamage`, `can_ranged`, `rangedattacktime`, `rangedmindamage`, `rangedmaxdamage`, `respawntime`, `armor`, `resistance1`, `resistance2`, `resistance3`, `resistance4`, `resistance5`, `resistance6`, `combat_reach`, `bounding_radius`, `auras`, `boss`, `money`, `invisibility_type`, `walk_speed`, `run_speed`, `fly_speed`, `extra_a9_flags`, `spell1`, `spell2`, `spell3`, `spell4`, `spell5`, `spell6`, `spell7`, `spell8`, `spell_flags`, `modImmunities`, `isTrainingDummy`, `guardtype`, `summonguard`, `spelldataid`, `vehicleid`, `rooted`) VALUES (300000, 1, 2, 35, 380, 14000, 53, 1, 0, 2000, 0, 2, 2, 0, 0, 0, 0, 0, 8, 0, 0, 0, 0, 0, 0, 0, 0, '', 0, 0, 0, 2.5, 8, 14, 0, 0, 0, 0, 0, 0, 0, 0, 0, 0, 0, 0, 0, 0, 0, 0, 0);


    INSERT INTO `items` (`entry`, `class`, `subclass`, `field4`, `name1`, `displayid`, `quality`, `flags`, `flags2`, `buyprice`, `sellprice`, `inventorytype`, `allowableclass`, `allowablerace`, `itemlevel`, `requiredlevel`, `RequiredSkill`, `RequiredSkillRank`, `RequiredSpell`, `RequiredPlayerRank1`, `RequiredPlayerRank2`, `RequiredFaction`, `RequiredFactionStanding`, `Unique`, `maxcount`, `ContainerSlots`, `itemstatscount`, `stat_type1`, `stat_value1`, `stat_type2`, `stat_value2`, `stat_type3`, `stat_value3`, `stat_type4`, `stat_value4`, `stat_type5`, `stat_value5`, `stat_type6`, `stat_value6`, `stat_type7`, `stat_value7`, `stat_type8`, `stat_value8`, `stat_type9`, `stat_value9`, `stat_type10`, `stat_value10`, `ScaledStatsDistributionId`, `ScaledStatsDistributionFlags`, `dmg_min1`, `dmg_max1`, `dmg_type1`, `dmg_min2`, `dmg_max2`, `dmg_type2`, `armor`, `holy_res`, `fire_res`, `nature_res`, `frost_res`, `shadow_res`, `arcane_res`, `delay`, `ammo_type`, `range`, `spellid_1`, `spelltrigger_1`, `spellcharges_1`, `spellcooldown_1`, `spellcategory_1`, `spellcategorycooldown_1`, `spellid_2`, `spelltrigger_2`, `spellcharges_2`, `spellcooldown_2`, `spellcategory_2`, `spellcategorycooldown_2`, `spellid_3`, `spelltrigger_3`, `spellcharges_3`, `spellcooldown_3`, `spellcategory_3`, `spellcategorycooldown_3`, `spellid_4`, `spelltrigger_4`, `spellcharges_4`, `spellcooldown_4`, `spellcategory_4`, `spellcategorycooldown_4`, `spellid_5`, `spelltrigger_5`, `spellcharges_5`, `spellcooldown_5`, `spellcategory_5`, `spellcategorycooldown_5`, `bonding`, `description`, `page_id`, `page_language`, `page_material`, `quest_id`, `lock_id`, `lock_material`, `sheathID`, `randomprop`, `randomsuffix`, `block`, `itemset`, `MaxDurability`, `ZoneNameID`, `mapid`, `bagfamily`, `TotemCategory`, `socket_color_1`, `unk201_3`, `socket_color_2`, `unk201_5`, `socket_color_3`, `unk201_7`, `socket_bonus`, `GemProperties`, `ReqDisenchantSkill`, `ArmorDamageModifier`, `existingduration`, `ItemLimitCategoryId`, `HolidayId`) VALUES (80000, 15, 5, -1, 'DCD Welcome mount', 59462, 4, 0, 0, 100000, 0, 0, 262143, 2147483647, 1, 1, 762, 0, 0, 0, 0, 0, 0, 1, 1, 0, 0, 0, 0, 0, 0, 0, 0, 0, 0, 0, 0, 0, 0, 0, 0, 0, 0, 0, 0, 0, 0, 0, 0, 0, 0, 0, 0, 0, 0, 0, 0, 0, 0, 0, 0, 0, 0, 0, 0, 55884, 0, -1, -1, 330, 3000, 1000000, 6, 0, 0, 0, 0, 0, 0, 0, 0, 0, 0, 0, 0, 0, 0, 0, 0, 0, 0, 0, 0, 0, 0, 1, 'Teaches you how to summon this mount.  This is a very fast mount.', 0, 0, 0, 0, 0, 4, 0, 0, 0, 0, 0, 0, 0, 0, 0, 0, 0, 0, 0, 0, 0, 0, 0, 0, -1, 0, 0, 0, 0);


    heres the mount i plan on making my welcome server mount as you can see a gm can mount up on anything they want to
  2. Somethings Wrong Here Guys

    04 November 2013 - 01:17 AM

    just did a revision update and i got this

    1>------ Build started: Project: ZERO_CHECK, Configuration: Debug Win32 ------
    1>  Checking Build System
    1>CUSTOMBUILD : CMake error : Cannot restore timestamp E:/ArcEmu/Build/CMakeFiles/generate.stamp
    1>  
    1>  
    1>  E:\ArcEmu\Code>REM sadly CMake cannot directly execute the shell scripts under msysgit even if they are associated 
    1>  
    1>  Configuring scripts :
    1>  	luabridge was skipped because BUILD_LUABRIDGE is unchecked.
    1>  -- Configuring incomplete, errors occurred!
    1>CUSTOMBUILD : CMake error : Unable to open check cache file for write. E:/ArcEmu/Build/CMakeFiles/cmake.check_cache
    1>  CMake Configure step failed.  Build files cannot be regenerated correctly.  Attempting to stop IDE build.
    2>------ Build started: Project: bzip2, Configuration: Debug Win32 ------
    3>------ Build started: Project: g3dlite, Configuration: Debug Win32 ------
    2>  Building Custom Rule E:/ArcEmu/Code/cmake/tools/bzip2/CMakeLists.txt
    2>CUSTOMBUILD : CMake error : Cannot restore timestamp E:\ArcEmu\Build\tools\bzip2\CMakeFiles\generate.stamp
    2>  
    2>  
    2>  E:\ArcEmu\Code>REM sadly CMake cannot directly execute the shell scripts under msysgit even if they are associated 
    2>  
    2>  Configuring scripts :
    2>  	luabridge was skipped because BUILD_LUABRIDGE is unchecked.
    3>  Building Custom Rule E:/ArcEmu/Code/cmake/g3dlite/CMakeLists.txt
    3>CUSTOMBUILD : CMake error : Cannot restore timestamp E:\ArcEmu\Build\g3dlite\CMakeFiles\generate.stamp
    3>  
    2>  -- Configuring incomplete, errors occurred!
    3>  
    3>  E:\ArcEmu\Code>REM sadly CMake cannot directly execute the shell scripts under msysgit even if they are associated 
    3>  
    3>  Configuring scripts :
    3>  	luabridge was skipped because BUILD_LUABRIDGE is unchecked.
    3>  -- Configuring incomplete, errors occurred!
    3>CUSTOMBUILD : CMake error : Unable to open check cache file for write. E:/ArcEmu/Build/CMakeFiles/cmake.check_cache
    2>CUSTOMBUILD : CMake error : Unable to open check cache file for write. E:/ArcEmu/Build/CMakeFiles/cmake.check_cache
    4>------ Build started: Project: zlib, Configuration: Debug Win32 ------
    5>------ Build started: Project: recast, Configuration: Debug Win32 ------
    5>  Building Custom Rule E:/ArcEmu/Code/cmake/recast/CMakeLists.txt
    5>CUSTOMBUILD : CMake error : Cannot restore timestamp E:\ArcEmu\Build\recast\CMakeFiles\generate.stamp
    4>  Building Custom Rule E:/ArcEmu/Code/cmake/zlib/CMakeLists.txt
    4>CUSTOMBUILD : CMake error : Cannot restore timestamp E:\ArcEmu\Build\zlib\CMakeFiles\generate.stamp
    4>  
    4>  
    4>  E:\ArcEmu\Code>REM sadly CMake cannot directly execute the shell scripts under msysgit even if they are associated 
    4>  
    4>  Configuring scripts :
    5>  
    5>  
    5>  E:\ArcEmu\Code>REM sadly CMake cannot directly execute the shell scripts under msysgit even if they are associated 
    5>  
    4>  	luabridge was skipped because BUILD_LUABRIDGE is unchecked.
    4>  -- Configuring incomplete, errors occurred!
    4>CUSTOMBUILD : CMake error : Unable to open check cache file for write. E:/ArcEmu/Build/CMakeFiles/cmake.check_cache
    5>  Configuring scripts :
    5>  	luabridge was skipped because BUILD_LUABRIDGE is unchecked.
    5>  -- Configuring incomplete, errors occurred!
    5>CUSTOMBUILD : CMake error : Unable to open check cache file for write. E:/ArcEmu/Build/CMakeFiles/cmake.check_cache
    6>------ Build started: Project: libmpq_new, Configuration: Debug Win32 ------
    7>------ Build started: Project: shared, Configuration: Debug Win32 ------
    7>  Building Custom Rule E:/ArcEmu/Code/cmake/shared/CMakeLists.txt
    7>CUSTOMBUILD : CMake error : Cannot restore timestamp E:\ArcEmu\Build\shared\CMakeFiles\generate.stamp
    7>  
    7>  
    7>  E:\ArcEmu\Code>REM sadly CMake cannot directly execute the shell scripts under msysgit even if they are associated 
    7>  
    7>  Configuring scripts :
    7>  	luabridge was skipped because BUILD_LUABRIDGE is unchecked.
    7>  -- Configuring incomplete, errors occurred!
    7>CUSTOMBUILD : CMake error : Unable to open check cache file for write. E:/ArcEmu/Build/CMakeFiles/cmake.check_cache
    8>------ Build started: Project: pcre, Configuration: Debug Win32 ------
    8>  Building Custom Rule E:/ArcEmu/Code/cmake/pcre/CMakeLists.txt
    8>CUSTOMBUILD : CMake error : Cannot restore timestamp E:\ArcEmu\Build\pcre\CMakeFiles\generate.stamp
    8>  
    8>  
    8>  E:\ArcEmu\Code>REM sadly CMake cannot directly execute the shell scripts under msysgit even if they are associated 
    8>  
    6>  Building Custom Rule E:/ArcEmu/Code/cmake/tools/libmpq_new/CMakeLists.txt
    6>CUSTOMBUILD : CMake error : Cannot restore timestamp E:\ArcEmu\Build\tools\libmpq_new\CMakeFiles\generate.stamp
    6>  
    6>  
    6>  E:\ArcEmu\Code>REM sadly CMake cannot directly execute the shell scripts under msysgit even if they are associated 
    6>  
    6>  Configuring scripts :
    6>  	luabridge was skipped because BUILD_LUABRIDGE is unchecked.
    6>  -- Configuring incomplete, errors occurred!
    6>CUSTOMBUILD : CMake error : Unable to open check cache file for write. E:/ArcEmu/Build/CMakeFiles/cmake.check_cache
    9>------ Build started: Project: vmaplib, Configuration: Debug Win32 ------
    8>  Configuring scripts :
    8>  	luabridge was skipped because BUILD_LUABRIDGE is unchecked.
    8>  -- Configuring incomplete, errors occurred!
    8>CUSTOMBUILD : CMake error : Unable to open check cache file for write. E:/ArcEmu/Build/CMakeFiles/cmake.check_cache
    10>------ Build started: Project: detour, Configuration: Debug Win32 ------
    10>  Building Custom Rule E:/ArcEmu/Code/cmake/detour/CMakeLists.txt
    9>  Building Custom Rule E:/ArcEmu/Code/cmake/vmaplib/CMakeLists.txt
    9>CUSTOMBUILD : CMake error : Cannot restore timestamp E:\ArcEmu\Build\vmaplib\CMakeFiles\generate.stamp
    9>  
    9>  
    9>  E:\ArcEmu\Code>REM sadly CMake cannot directly execute the shell scripts under msysgit even if they are associated 
    9>  
    9>  Configuring scripts :
    9>  	luabridge was skipped because BUILD_LUABRIDGE is unchecked.
    9>  -- Configuring incomplete, errors occurred!
    9>CUSTOMBUILD : CMake error : Unable to open check cache file for write. E:/ArcEmu/Build/CMakeFiles/cmake.check_cache
    10>CUSTOMBUILD : CMake error : Cannot restore timestamp E:\ArcEmu\Build\detour\CMakeFiles\generate.stamp
    10>  
    10>  
    10>  E:\ArcEmu\Code>REM sadly CMake cannot directly execute the shell scripts under msysgit even if they are associated 
    10>  
    11>------ Build started: Project: dbcfile, Configuration: Debug Win32 ------
    10>  Configuring scripts :
    10>  	luabridge was skipped because BUILD_LUABRIDGE is unchecked.
    10>  -- Configuring incomplete, errors occurred!
    10>CUSTOMBUILD : CMake error : Unable to open check cache file for write. E:/ArcEmu/Build/CMakeFiles/cmake.check_cache
    12>------ Build started: Project: lualib, Configuration: Debug Win32 ------
    12>  Building Custom Rule E:/ArcEmu/Code/cmake/scripts/lualib/CMakeLists.txt
    12>CUSTOMBUILD : CMake error : Cannot restore timestamp E:\ArcEmu\Build\scripts\lualib\CMakeFiles\generate.stamp
    12>  
    12>  
    12>  E:\ArcEmu\Code>REM sadly CMake cannot directly execute the shell scripts under msysgit even if they are associated 
    12>  
    11>  Building Custom Rule E:/ArcEmu/Code/cmake/tools/dbcfile/CMakeLists.txt
    11>CUSTOMBUILD : CMake error : Cannot restore timestamp E:\ArcEmu\Build\tools\dbcfile\CMakeFiles\generate.stamp
    11>  
    11>  
    11>  E:\ArcEmu\Code>REM sadly CMake cannot directly execute the shell scripts under msysgit even if they are associated 
    11>  
    11>  Configuring scripts :
    11>  	luabridge was skipped because BUILD_LUABRIDGE is unchecked.
    11>  -- Configuring incomplete, errors occurred!
    11>CUSTOMBUILD : CMake error : Unable to open check cache file for write. E:/ArcEmu/Build/CMakeFiles/cmake.check_cache
    12>  Configuring scripts :
    12>  	luabridge was skipped because BUILD_LUABRIDGE is unchecked.
    12>  -- Configuring incomplete, errors occurred!
    13>------ Build started: Project: loadlib, Configuration: Debug Win32 ------
    12>CUSTOMBUILD : CMake error : Unable to open check cache file for write. E:/ArcEmu/Build/CMakeFiles/cmake.check_cache
    14>------ Build started: Project: world, Configuration: Debug Win32 ------
    13>  Building Custom Rule E:/ArcEmu/Code/cmake/tools/loadlib/CMakeLists.txt
    13>CUSTOMBUILD : CMake error : Cannot restore timestamp E:\ArcEmu\Build\tools\loadlib\CMakeFiles\generate.stamp
    13>  
    13>  
    13>  E:\ArcEmu\Code>REM sadly CMake cannot directly execute the shell scripts under msysgit even if they are associated 
    13>  
    13>  Configuring scripts :
    13>  	luabridge was skipped because BUILD_LUABRIDGE is unchecked.
    13>  -- Configuring incomplete, errors occurred!
    13>CUSTOMBUILD : CMake error : Unable to open check cache file for write. E:/ArcEmu/Build/CMakeFiles/cmake.check_cache
    14>  Building Custom Rule E:/ArcEmu/Code/cmake/world/CMakeLists.txt
    15>------ Build started: Project: creature_data, Configuration: Debug Win32 ------
    14>CUSTOMBUILD : CMake error : Cannot restore timestamp E:\ArcEmu\Build\world\CMakeFiles\generate.stamp
    14>  
    14>  
    14>  E:\ArcEmu\Code>REM sadly CMake cannot directly execute the shell scripts under msysgit even if they are associated 
    14>  
    14>  Configuring scripts :
    14>  	luabridge was skipped because BUILD_LUABRIDGE is unchecked.
    14>  -- Configuring incomplete, errors occurred!
    14>CUSTOMBUILD : CMake error : Unable to open check cache file for write. E:/ArcEmu/Build/CMakeFiles/cmake.check_cache
    15>  Building Custom Rule E:/ArcEmu/Code/cmake/tools/creature_data/CMakeLists.txt
    15>CUSTOMBUILD : CMake error : Cannot restore timestamp E:\ArcEmu\Build\tools\creature_data\CMakeFiles\generate.stamp
    15>  
    15>  
    15>  E:\ArcEmu\Code>REM sadly CMake cannot directly execute the shell scripts under msysgit even if they are associated 
    15>  
    15>  Configuring scripts :
    15>  	luabridge was skipped because BUILD_LUABRIDGE is unchecked.
    15>  -- Configuring incomplete, errors occurred!
    15>CUSTOMBUILD : CMake error : Unable to open check cache file for write. E:/ArcEmu/Build/CMakeFiles/cmake.check_cache
    16>------ Build started: Project: vmap_extractor, Configuration: Debug Win32 ------
    17>------ Build started: Project: vmap_assembler, Configuration: Debug Win32 ------
    17>  Building Custom Rule E:/ArcEmu/Code/cmake/tools/vmap_tools/vmap_assembler/CMakeLists.txt
    17>CUSTOMBUILD : CMake error : Cannot restore timestamp E:\ArcEmu\Build\tools\vmap_tools\vmap_assembler\CMakeFiles\generate.stamp
    17>  
    17>  
    17>  E:\ArcEmu\Code>REM sadly CMake cannot directly execute the shell scripts under msysgit even if they are associated 
    17>  
    17>  Configuring scripts :
    17>  	luabridge was skipped because BUILD_LUABRIDGE is unchecked.
    17>  -- Configuring incomplete, errors occurred!
    17>CUSTOMBUILD : CMake error : Unable to open check cache file for write. E:/ArcEmu/Build/CMakeFiles/cmake.check_cache
    18>------ Build started: Project: ad, Configuration: Debug Win32 ------
    16>  Building Custom Rule E:/ArcEmu/Code/cmake/tools/vmap_tools/vmap_extractor/CMakeLists.txt
    16>CUSTOMBUILD : CMake error : Cannot restore timestamp E:\ArcEmu\Build\tools\vmap_tools\vmap_extractor\CMakeFiles\generate.stamp
    16>  
    16>  
    16>  E:\ArcEmu\Code>REM sadly CMake cannot directly execute the shell scripts under msysgit even if they are associated 
    16>  
    16>  Configuring scripts :
    16>  	luabridge was skipped because BUILD_LUABRIDGE is unchecked.
    16>  -- Configuring incomplete, errors occurred!
    16>CUSTOMBUILD : CMake error : Unable to open check cache file for write. E:/ArcEmu/Build/CMakeFiles/cmake.check_cache
    19>------ Build started: Project: logon, Configuration: Debug Win32 ------
    19>  Building Custom Rule E:/ArcEmu/Code/cmake/logon/CMakeLists.txt
    18>  Building Custom Rule E:/ArcEmu/Code/cmake/tools/ad/CMakeLists.txt
    18>CUSTOMBUILD : CMake error : Cannot restore timestamp E:\ArcEmu\Build\tools\ad\CMakeFiles\generate.stamp
    18>  
    18>  
    18>  E:\ArcEmu\Code>REM sadly CMake cannot directly execute the shell scripts under msysgit even if they are associated 
    18>  
    18>  Configuring scripts :
    18>  	luabridge was skipped because BUILD_LUABRIDGE is unchecked.
    18>  -- Configuring incomplete, errors occurred!
    18>CUSTOMBUILD : CMake error : Unable to open check cache file for write. E:/ArcEmu/Build/CMakeFiles/cmake.check_cache
    20>------ Build started: Project: SpellHandlers, Configuration: Debug Win32 ------
    19>CUSTOMBUILD : CMake error : Cannot restore timestamp E:\ArcEmu\Build\logon\CMakeFiles\generate.stamp
    19>  
    19>  
    19>  E:\ArcEmu\Code>REM sadly CMake cannot directly execute the shell scripts under msysgit even if they are associated 
    19>  
    19>  Configuring scripts :
    19>  	luabridge was skipped because BUILD_LUABRIDGE is unchecked.
    19>  -- Configuring incomplete, errors occurred!
    19>CUSTOMBUILD : CMake error : Unable to open check cache file for write. E:/ArcEmu/Build/CMakeFiles/cmake.check_cache
    20>  Building Custom Rule E:/ArcEmu/Code/cmake/spellhandlers/CMakeLists.txt
    21>------ Build started: Project: ServerStatusPlugin, Configuration: Debug Win32 ------
    21>  Building Custom Rule E:/ArcEmu/Code/cmake/scripts/serverstatusplugin/CMakeLists.txt
    20>CUSTOMBUILD : CMake error : Cannot restore timestamp E:\ArcEmu\Build\spellhandlers\CMakeFiles\generate.stamp
    20>  
    20>  
    20>  E:\ArcEmu\Code>REM sadly CMake cannot directly execute the shell scripts under msysgit even if they are associated 
    20>  
    20>  Configuring scripts :
    20>  	luabridge was skipped because BUILD_LUABRIDGE is unchecked.
    20>  -- Configuring incomplete, errors occurred!
    21>CUSTOMBUILD : CMake error : Cannot restore timestamp E:\ArcEmu\Build\scripts\serverstatusplugin\CMakeFiles\generate.stamp
    20>CUSTOMBUILD : CMake error : Unable to open check cache file for write. E:/ArcEmu/Build/CMakeFiles/cmake.check_cache
    21>  
    21>  
    21>  E:\ArcEmu\Code>REM sadly CMake cannot directly execute the shell scripts under msysgit even if they are associated 
    21>  
    22>------ Build started: Project: QuestScripts, Configuration: Debug Win32 ------
    21>  Configuring scripts :
    21>  	luabridge was skipped because BUILD_LUABRIDGE is unchecked.
    21>  -- Configuring incomplete, errors occurred!
    21>CUSTOMBUILD : CMake error : Unable to open check cache file for write. E:/ArcEmu/Build/CMakeFiles/cmake.check_cache
    23>------ Build started: Project: MiscScripts, Configuration: Debug Win32 ------
    23>  Building Custom Rule E:/ArcEmu/Code/cmake/scripts/miscscripts/CMakeLists.txt
    23>CUSTOMBUILD : CMake error : Cannot restore timestamp E:\ArcEmu\Build\scripts\miscscripts\CMakeFiles\generate.stamp
    22>  Building Custom Rule E:/ArcEmu/Code/cmake/scripts/questscripts/CMakeLists.txt
    23>  
    23>  
    22>CUSTOMBUILD : CMake error : Cannot restore timestamp E:\ArcEmu\Build\scripts\questscripts\CMakeFiles\generate.stamp
    22>  
    22>  
    22>  E:\ArcEmu\Code>REM sadly CMake cannot directly execute the shell scripts under msysgit even if they are associated 
    22>  
    22>  Configuring scripts :
    22>  	luabridge was skipped because BUILD_LUABRIDGE is unchecked.
    23>  E:\ArcEmu\Code>REM sadly CMake cannot directly execute the shell scripts under msysgit even if they are associated 
    22>  -- Configuring incomplete, errors occurred!
    23>  
    22>CUSTOMBUILD : CMake error : Unable to open check cache file for write. E:/ArcEmu/Build/CMakeFiles/cmake.check_cache
    24>------ Build started: Project: LuaEngine, Configuration: Debug Win32 ------
    23>  Configuring scripts :
    23>  	luabridge was skipped because BUILD_LUABRIDGE is unchecked.
    23>  -- Configuring incomplete, errors occurred!
    23>CUSTOMBUILD : CMake error : Unable to open check cache file for write. E:/ArcEmu/Build/CMakeFiles/cmake.check_cache
    25>------ Build started: Project: InstanceScripts, Configuration: Debug Win32 ------
    25>  Building Custom Rule E:/ArcEmu/Code/cmake/scripts/instancescripts/CMakeLists.txt
    25>CUSTOMBUILD : CMake error : Cannot restore timestamp E:\ArcEmu\Build\scripts\instancescripts\CMakeFiles\generate.stamp
    25>  
    25>  
    25>  E:\ArcEmu\Code>REM sadly CMake cannot directly execute the shell scripts under msysgit even if they are associated 
    25>  
    24>  Building Custom Rule E:/ArcEmu/Code/cmake/scripts/luaengine/CMakeLists.txt
    24>CUSTOMBUILD : CMake error : Cannot restore timestamp E:\ArcEmu\Build\scripts\luaengine\CMakeFiles\generate.stamp
    24>  
    24>  
    24>  E:\ArcEmu\Code>REM sadly CMake cannot directly execute the shell scripts under msysgit even if they are associated 
    24>  
    24>  Configuring scripts :
    24>  	luabridge was skipped because BUILD_LUABRIDGE is unchecked.
    24>  -- Configuring incomplete, errors occurred!
    24>CUSTOMBUILD : CMake error : Unable to open check cache file for write. E:/ArcEmu/Build/CMakeFiles/cmake.check_cache
    25>  Configuring scripts :
    25>  	luabridge was skipped because BUILD_LUABRIDGE is unchecked.
    26>------ Build started: Project: Battlegrounds, Configuration: Debug Win32 ------
    25>  -- Configuring incomplete, errors occurred!
    25>CUSTOMBUILD : CMake error : Unable to open check cache file for write. E:/ArcEmu/Build/CMakeFiles/cmake.check_cache
    27>------ Build started: Project: GossipScripts, Configuration: Debug Win32 ------
    27>  Building Custom Rule E:/ArcEmu/Code/cmake/scripts/gossipscripts/CMakeLists.txt
    27>CUSTOMBUILD : CMake error : Cannot restore timestamp E:\ArcEmu\Build\scripts\gossipscripts\CMakeFiles\generate.stamp
    27>  
    27>  
    27>  E:\ArcEmu\Code>REM sadly CMake cannot directly execute the shell scripts under msysgit even if they are associated 
    27>  
    27>  Configuring scripts :
    26>  Building Custom Rule E:/ArcEmu/Code/cmake/battlegrounds/CMakeLists.txt
    26>CUSTOMBUILD : CMake error : Cannot restore timestamp E:\ArcEmu\Build\battlegrounds\CMakeFiles\generate.stamp
    27>  	luabridge was skipped because BUILD_LUABRIDGE is unchecked.
    26>  
    26>  
    26>  E:\ArcEmu\Code>REM sadly CMake cannot directly execute the shell scripts under msysgit even if they are associated 
    26>  
    26>  Configuring scripts :
    26>  	luabridge was skipped because BUILD_LUABRIDGE is unchecked.
    26>  -- Configuring incomplete, errors occurred!
    26>CUSTOMBUILD : CMake error : Unable to open check cache file for write. E:/ArcEmu/Build/CMakeFiles/cmake.check_cache
    27>  -- Configuring incomplete, errors occurred!
    27>CUSTOMBUILD : CMake error : Unable to open check cache file for write. E:/ArcEmu/Build/CMakeFiles/cmake.check_cache
    28>------ Build started: Project: ExtraScripts, Configuration: Debug Win32 ------
    29>------ Build started: Project: EventScripts, Configuration: Debug Win32 ------
    29>  Building Custom Rule E:/ArcEmu/Code/cmake/scripts/eventscripts/CMakeLists.txt
    29>CUSTOMBUILD : CMake error : Cannot restore timestamp E:\ArcEmu\Build\scripts\eventscripts\CMakeFiles\generate.stamp
    29>  
    29>  
    29>  E:\ArcEmu\Code>REM sadly CMake cannot directly execute the shell scripts under msysgit even if they are associated 
    29>  
    28>  Building Custom Rule E:/ArcEmu/Code/cmake/scripts/extrascripts/CMakeLists.txt
    28>CUSTOMBUILD : CMake error : Cannot restore timestamp E:\ArcEmu\Build\scripts\extrascripts\CMakeFiles\generate.stamp
    28>  
    28>  
    28>  E:\ArcEmu\Code>REM sadly CMake cannot directly execute the shell scripts under msysgit even if they are associated 
    28>  
    28>  Configuring scripts :
    28>  	luabridge was skipped because BUILD_LUABRIDGE is unchecked.
    28>  -- Configuring incomplete, errors occurred!
    28>CUSTOMBUILD : CMake error : Unable to open check cache file for write. E:/ArcEmu/Build/CMakeFiles/cmake.check_cache
    29>  Configuring scripts :
    29>  	luabridge was skipped because BUILD_LUABRIDGE is unchecked.
    29>  -- Configuring incomplete, errors occurred!
    29>CUSTOMBUILD : CMake error : Unable to open check cache file for write. E:/ArcEmu/Build/CMakeFiles/cmake.check_cache
    30>------ Build started: Project: ALL_BUILD, Configuration: Debug Win32 ------
    30>  Building Custom Rule E:/ArcEmu/Code/cmake/CMakeLists.txt
    30>CUSTOMBUILD : CMake error : Cannot restore timestamp E:\ArcEmu\Build\CMakeFiles\generate.stamp
    30>  
    30>  
    30>  E:\ArcEmu\Code>REM sadly CMake cannot directly execute the shell scripts under msysgit even if they are associated 
    30>  
    30>  Configuring scripts :
    30>  	luabridge was skipped because BUILD_LUABRIDGE is unchecked.
    30>  -- Configuring incomplete, errors occurred!
    30>CUSTOMBUILD : CMake error : Unable to open check cache file for write. E:/ArcEmu/Build/CMakeFiles/cmake.check_cache
    31>------ Skipped Build: Project: INSTALL, Configuration: Debug Win32 ------
    31>Project not selected to build for this solution configuration 
    ========== Build: 0 succeeded, 30 failed, 0 up-to-date, 1 skipped ==========
    


    nevermind forgot to run as admin lol use to winxp
  3. Wayyyyyy Off Topic

    01 November 2013 - 11:25 PM

    if i remember correctly this is why arcemu is amongst the best of emus

    ascent
    arcemu
    antrix
    FrostEmu
    open-ascent
    aspire
    hearthstone
    aspire/hearthstone
    WoWEmu
    AngelEmu
    Stormcraft
    these ones are all based off of each other if i remember correctly



    these ones are a why bother to build you cant even get past the first part

    trinitycore,1,2,etc...
    mangos
    SkyFire Emu
    there all part of each other and there's one missing i'm not sure what it was called




    these ones i never heard of before my guess is they wont last that long

    FrostFire
    Blackstorm
    AnonEmu
    ShadowMoses
    DescentEmu
    SpuriousEmu
    VBWOW
    Wcell
    shyemu
    keazein
    FeralEmu
    aquaEmu
    EndeavorEmu
    soulstone
    ElementCore
    AutumnEmu
    FoxEmu
    WoWD
    SummitEmu
    WoWlegacy/Deathwing
    if you ask me they should be scrapped or all combined into arcemu to give them a helping hand

    lets give it up for arcemu for the most easy to build most stable and friendly support project out there
    the team is willing to help solve your problem even tho they don't have to

    its just why arcemu is still the best out there


    wasn't spaced properly
  4. Cmake Error Need Help

    01 September 2013 - 07:10 AM

    iv decided to come back to test out builds again and im new to this whole cmake thing heres my issue


    The C compiler identification is MSVC 16.0.30319.1

    The CXX compiler identification is MSVC 16.0.30319.1

    Check for working C compiler using: Visual Studio 10

    Check for working C compiler using: Visual Studio 10 -- broken

    CMake Error at C:/Users/cyber15001/Downloads/Old2/cmake-2.8.11.2-win32-x86/cmake-2.8.11.2-win32-x86/share/cmake-2.8/Modules/CMakeTestCCompiler.cmake:61 (message):

    The C compiler "C:/Program Files (x86)/Microsoft Visual Studio

    10.0/VC/bin/cl.exe" is not able to compile a simple test program.



    It fails with the following output:



    Change Dir: C:/ArcEmu/Build/CMakeFiles/CMakeTmp







    Run Build Command:C:\Windows\Microsoft.NET\Framework\v4.0.30319\MSBuild.exe

    cmTryCompileExec1866115346.vcxproj /p:Configuration=Debug

    /p:VisualStudioVersion=10.0



    Microsoft ® Build Engine version 4.0.30319.17929



    [Microsoft .NET Framework, version 4.0.30319.18052]



    Copyright © Microsoft Corporation. All rights reserved.







    Build started 9/1/2013 7:55:48 AM.



    Project

    "C:\ArcEmu\Build\CMakeFiles\CMakeTmp\cmTryCompileExec1866115346.vcxproj" on

    node 1 (default targets).



    PrepareForBuild:



    Creating directory "cmTryCompileExec1866115346.dir\Debug\".

    Creating directory "C:\ArcEmu\Build\CMakeFiles\CMakeTmp\Debug\".



    InitializeBuildStatus:



    Creating "cmTryCompileExec1866115346.dir\Debug\cmTryCompileExec1866115346.unsuccessfulbuild" because "AlwaysCreate" was specified.



    ClCompile:



    C:\Program Files (x86)\Microsoft Visual Studio 10.0\VC\bin\CL.exe /c /Zi /W3 /WX- /Od /Ob0 /Oy- /D WIN32 /D _WINDOWS /D _DEBUG /D "CMAKE_INTDIR=\"Debug\"" /D _MBCS /Gm- /RTC1 /MDd /GS /fp:precise /Zc:wchar_t /Zc:forScope /Fo"cmTryCompileExec1866115346.dir\Debug\\" /Fd"C:/ArcEmu/Build/CMakeFiles/CMakeTmp/Debug/cmTryCompileExec1866115346.pdb" /Gd /TC /analyze- /errorReport:queue testCCompiler.c

    Microsoft ® 32-bit C/C++ Optimizing Compiler Version 16.00.30319.01 for 80x86

    Copyright © Microsoft Corporation. All rights reserved.



    cl /c /Zi /W3 /WX- /Od /Ob0 /Oy- /D WIN32 /D _WINDOWS /D _DEBUG /D "CMAKE_INTDIR=\"Debug\"" /D _MBCS /Gm- /RTC1 /MDd /GS /fp:precise /Zc:wchar_t /Zc:forScope /Fo"cmTryCompileExec1866115346.dir\Debug\\" /Fd"C:/ArcEmu/Build/CMakeFiles/CMakeTmp/Debug/cmTryCompileExec1866115346.pdb" /Gd /TC /analyze- /errorReport:queue testCCompiler.c



    testCCompiler.c



    ManifestResourceCompile:



    C:\Program Files (x86)\Microsoft SDKs\Windows\v7.0A\bin\rc.exe /nologo /fo"cmTryCompileExec1866115346.dir\Debug\cmTryCompileExec1866115346.exe.embed.manifest.res" cmTryCompileExec1866115346.dir\Debug\cmTryCompileExec1866115346_manifest.rc



    Link:



    C:\Program Files (x86)\Microsoft Visual Studio 10.0\VC\bin\link.exe /ERRORREPORT:QUEUE /OUT:"C:\ArcEmu\Build\CMakeFiles\CMakeTmp\Debug\cmTryCompileExec1866115346.exe" /INCREMENTAL /NOLOGO kernel32.lib user32.lib gdi32.lib winspool.lib shell32.lib ole32.lib oleaut32.lib uuid.lib comdlg32.lib advapi32.lib /MANIFEST /ManifestFile:"cmTryCompileExec1866115346.dir\Debug\cmTryCompileExec1866115346.exe.intermediate.manifest" /MANIFESTUAC:"level='asInvoker' uiAccess='false'" /DEBUG /PDB:"C:/ArcEmu/Build/CMakeFiles/CMakeTmp/Debug/cmTryCompileExec1866115346.pdb" /SUBSYSTEM:CONSOLE /TLBID:1 /DYNAMICBASE /NXCOMPAT /IMPLIB:"C:/ArcEmu/Build/CMakeFiles/CMakeTmp/Debug/cmTryCompileExec1866115346.lib" /MACHINE:X86 cmTryCompileExec1866115346.dir\Debug\cmTryCompileExec1866115346.exe.embed.manifest.res

    cmTryCompileExec1866115346.dir\Debug\testCCompiler.obj /machine:X86 /debug



    LINK : fatal error LNK1123: failure during conversion to COFF: file invalid

    or corrupt

    [C:\ArcEmu\Build\CMakeFiles\CMakeTmp\cmTryCompileExec1866115346.vcxproj]



    Done Building Project

    "C:\ArcEmu\Build\CMakeFiles\CMakeTmp\cmTryCompileExec1866115346.vcxproj"

    (default targets) -- FAILED.







    Build FAILED.







    "C:\ArcEmu\Build\CMakeFiles\CMakeTmp\cmTryCompileExec1866115346.vcxproj"

    (default target) (1) ->



    (Link target) ->



    LINK : fatal error LNK1123: failure during conversion to COFF: file invalid or corrupt [C:\ArcEmu\Build\CMakeFiles\CMakeTmp\cmTryCompileExec1866115346.vcxproj]







    0 Warning(s)

    1 Error(s)







    Time Elapsed 00:00:00.49











    CMake will not be able to correctly generate this project.

    Call Stack (most recent call first):

    CMakeLists.txt:1 (project)





    Configuring incomplete, errors occurred!



    i have no idea what this means




    computer specs

    Acer

    Aspire X1700

    Windows Vista Home Premium SP2

    Processor Dual Intel Pentium 2.40GHz

    4.00 GB ram

    64-bit os


    ""sorry for post being so long""