ArcEmu: Compile Errors - Win7 - ArcEmu

Jump to content

Toggle shoutbox Lastest Announcements

dfighter  : (07 December 2014 - 12:06 PM) Arcemu is in hibernation mode, please read http://arcemu.org/fo...showtopic=26903
dfighter  : (01 January 2013 - 05:56 PM) Arcemu wishes you all a happy new year!
Hasbro  : (12 September 2012 - 10:01 AM) Please excuse our outage from the web! Our web host had a major malfunction!
dfighter  : (01 September 2012 - 04:05 PM) Since the spam bots just don't want to stop, I've enabled admin verification when registering.
dfighter  : (23 January 2012 - 09:56 PM) Please note that from now on you will need to confirm your email on the wiki in order to edit it!
Hasbro  : (31 December 2011 - 12:50 PM) Happy New Years all!
Navid  : (26 December 2011 - 04:09 AM) Merry Christmas !!!!!! Happy holidays all :)
WAmadeus  : (24 December 2011 - 03:54 PM) Merry Christmas to all!
dfighter  : (24 December 2011 - 11:05 AM) The Arcemu team wishes y'all a Merry Christmukkah!
Hasbro  : (05 October 2011 - 12:53 PM) Looking for web designers for upcoming web related project. If you're interested in designing user interfaces contact me
dfighter  : (02 September 2011 - 03:47 PM) So who here wants vehicles in Arcemu? :P http://arcemu.org/fo...showtopic=25440
Hasbro  : (14 August 2011 - 03:25 PM) Join us on irc, grab an irc client and connect to irc.freenode.net join channel #arcemu /server irc.freenode.net:6667 /join #arcemu
jackpoz  : (03 August 2011 - 05:33 AM) to all Lua Engine (old one) users: please check http://arcemu.org/fo...showtopic=25274
Hasbro  : (20 May 2011 - 05:27 PM) Looking for people experienced with CMake configuration and setup! Contact me asap
Hasbro  : (15 May 2011 - 05:03 PM) ArcEmu is recruiting C++ programmers, contact Hasbro if interested.
paroxysm  : (03 May 2011 - 06:26 PM) Updated luabridge gossip example to describe the whole gossip creation process rather than just how to create menu. Gossip tutorial
paroxysm  : (23 April 2011 - 11:35 AM) Lua writers can refer to the Luabridge Tutorials section in the Wiki to learn how to write gossip code correctly.
Hasbro  : (20 April 2011 - 05:22 PM) Thank you for your continuous contribution of bug reports, we are working on them.
Hasbro  : (17 April 2011 - 03:20 AM) Please consider donating to support our bills. Donations can be sent using PayPal to donations@arcemu.org - Thank you for your support.
paroxysm  : (10 April 2011 - 12:43 AM) Refer to the Luabridge Tutorials section in the Wiki to learn the new syntax of luabridge.
Resize Shouts Area

Page 1 of 1
  • You cannot start a new topic
  • You cannot reply to this topic

Compile Errors - Win7

#1 User is offline   hypemaster 

  • Newbie
  • Group: Members
  • Posts: 1
  • Joined: 14-May 13
  • Gender:Male
  • Location:Michigan, USA
  • Server OS:Windows

Posted 14 May 2013 - 08:51 PM

Installed .Net 4.0, VS 2010 Express, Git and Cmake. Generated Cmake files without errors but now when I compile I get several.

In cmake I have tried configuring heap limit to both 300/400 but same result.

1>------ Build started: Project: ZERO_CHECK, Configuration: Debug Win32 ------
1>  Checking Build System
1>  CMake does not need to re-run because C:/arcemu/build/CMakeFiles/generate.stamp is up-to-date.
1>  CMake does not need to re-run because C:/arcemu/build/zlib/CMakeFiles/generate.stamp is up-to-date.
1>  CMake does not need to re-run because C:/arcemu/build/pcre/CMakeFiles/generate.stamp is up-to-date.
1>  CMake does not need to re-run because C:/arcemu/build/g3dlite/CMakeFiles/generate.stamp is up-to-date.
1>  CMake does not need to re-run because C:/arcemu/build/vmaplib/CMakeFiles/generate.stamp is up-to-date.
1>  CMake does not need to re-run because C:/arcemu/build/recast/CMakeFiles/generate.stamp is up-to-date.
1>  CMake does not need to re-run because C:/arcemu/build/detour/CMakeFiles/generate.stamp is up-to-date.
1>  CMake does not need to re-run because C:/arcemu/build/shared/CMakeFiles/generate.stamp is up-to-date.
1>  CMake does not need to re-run because C:/arcemu/build/logon/CMakeFiles/generate.stamp is up-to-date.
1>  CMake does not need to re-run because C:/arcemu/build/world/CMakeFiles/generate.stamp is up-to-date.
1>  CMake does not need to re-run because C:/arcemu/build/spellhandlers/CMakeFiles/generate.stamp is up-to-date.
1>  CMake does not need to re-run because C:/arcemu/build/battlegrounds/CMakeFiles/generate.stamp is up-to-date.
1>  CMake does not need to re-run because C:/arcemu/build/scripts/CMakeFiles/generate.stamp is up-to-date.
1>  CMake does not need to re-run because C:/arcemu/build/scripts/eventscripts/CMakeFiles/generate.stamp is up-to-date.
1>  CMake does not need to re-run because C:/arcemu/build/scripts/instancescripts/CMakeFiles/generate.stamp is up-to-date.
1>  CMake does not need to re-run because C:/arcemu/build/scripts/extrascripts/CMakeFiles/generate.stamp is up-to-date.
1>  CMake does not need to re-run because C:/arcemu/build/scripts/gossipscripts/CMakeFiles/generate.stamp is up-to-date.
1>  CMake does not need to re-run because C:/arcemu/build/scripts/questscripts/CMakeFiles/generate.stamp is up-to-date.
1>  CMake does not need to re-run because C:/arcemu/build/scripts/miscscripts/CMakeFiles/generate.stamp is up-to-date.
1>  CMake does not need to re-run because C:/arcemu/build/scripts/serverstatusplugin/CMakeFiles/generate.stamp is up-to-date.
1>  CMake does not need to re-run because C:/arcemu/build/scripts/lualib/CMakeFiles/generate.stamp is up-to-date.
1>  CMake does not need to re-run because C:/arcemu/build/scripts/luabridge/CMakeFiles/generate.stamp is up-to-date.
1>  CMake does not need to re-run because C:/arcemu/build/scripts/luaengine/CMakeFiles/generate.stamp is up-to-date.
1>  CMake does not need to re-run because C:/arcemu/build/tools/CMakeFiles/generate.stamp is up-to-date.
1>  CMake does not need to re-run because C:/arcemu/build/tools/bzip2/CMakeFiles/generate.stamp is up-to-date.
1>  CMake does not need to re-run because C:/arcemu/build/tools/libmpq_new/CMakeFiles/generate.stamp is up-to-date.
1>  CMake does not need to re-run because C:/arcemu/build/tools/dbcfile/CMakeFiles/generate.stamp is up-to-date.
1>  CMake does not need to re-run because C:/arcemu/build/tools/loadlib/CMakeFiles/generate.stamp is up-to-date.
1>  CMake does not need to re-run because C:/arcemu/build/tools/ad/CMakeFiles/generate.stamp is up-to-date.
1>  CMake does not need to re-run because C:/arcemu/build/tools/creature_data/CMakeFiles/generate.stamp is up-to-date.
1>  CMake does not need to re-run because C:/arcemu/build/tools/vmap_tools/CMakeFiles/generate.stamp is up-to-date.
1>  CMake does not need to re-run because C:/arcemu/build/tools/vmap_tools/vmap_extractor/CMakeFiles/generate.stamp is up-to-date.
1>  CMake does not need to re-run because C:/arcemu/build/tools/vmap_tools/vmap_assembler/CMakeFiles/generate.stamp is up-to-date.
2>------ Build started: Project: bzip2, Configuration: Debug Win32 ------
3>------ Build started: Project: g3dlite, Configuration: Debug Win32 ------
2>  Building Custom Rule C:/arcemu/code/cmake/tools/bzip2/CMakeLists.txt
2>  CMake does not need to re-run because C:\arcemu\build\tools\bzip2\CMakeFiles\generate.stamp is up-to-date.
3>  Building Custom Rule C:/arcemu/code/cmake/g3dlite/CMakeLists.txt
3>  CMake does not need to re-run because C:\arcemu\build\g3dlite\CMakeFiles\generate.stamp is up-to-date.
2>  blocksort.c
2>  bzlib.c
3>  AABox.cpp
3>  Any.cpp
2>..\..\..\code\dep\src\bzip2\bzlib.c(1423): warning C4996: 'setmode': The POSIX name for this item is deprecated. Instead, use the ISO C++ conformant name: _setmode. See online help for details.
2>          C:\Program Files (x86)\Microsoft Visual Studio 10.0\VC\include\io.h(314) : see declaration of 'setmode'
2>..\..\..\code\dep\src\bzip2\bzlib.c(1423): warning C4996: 'fileno': The POSIX name for this item is deprecated. Instead, use the ISO C++ conformant name: _fileno. See online help for details.
2>          C:\Program Files (x86)\Microsoft Visual Studio 10.0\VC\include\stdio.h(723) : see declaration of 'fileno'
2>..\..\..\code\dep\src\bzip2\bzlib.c(1431): warning C4996: 'fdopen': The POSIX name for this item is deprecated. Instead, use the ISO C++ conformant name: _fdopen. See online help for details.
2>          C:\Program Files (x86)\Microsoft Visual Studio 10.0\VC\include\stdio.h(721) : see declaration of 'fdopen'
2>  compress.c
2>  crctable.c
2>  decompress.c
2>  huffman.c
2>  randtable.c
3>  BinaryFormat.cpp
2>  bzip2.vcxproj -> C:\arcemu\build\tools\bzip2\Debug\bzip2.lib
3>  BinaryInput.cpp
4>------ Build started: Project: zlib, Configuration: Debug Win32 ------
4>  Building Custom Rule C:/arcemu/code/cmake/zlib/CMakeLists.txt
4>  CMake does not need to re-run because C:\arcemu\build\zlib\CMakeFiles\generate.stamp is up-to-date.
4>  adler32.c
4>  compress.c
4>  crc32.c
4>  deflate.c
4>  example.c
3>  BinaryOutput.cpp
4>  gzio.c
4>  infback.c
4>  inffast.c
4>  inflate.c
4>  inftrees.c
4>  trees.c
4>  uncompr.c
4>  zutil.c
4>  zlib.vcxproj -> C:\arcemu\build\zlib\Debug\zlib.lib
5>------ Build started: Project: libmpq_new, Configuration: Debug Win32 ------
5>  Building Custom Rule C:/arcemu/code/cmake/tools/libmpq_new/CMakeLists.txt
5>  CMake does not need to re-run because C:\arcemu\build\tools\libmpq_new\CMakeFiles\generate.stamp is up-to-date.
5>  common.c
5>  explode.c
5>C:\arcemu\code\dep\include\libmpq_new\explode.h(39): warning C4103: 'c:\arcemu\code\dep\include\libmpq_new\explode.h' : alignment changed after including header, may be due to missing #pragma pack(pop)
5>C:\arcemu\code\dep\include\libmpq_new\explode.h(69): warning C4103: 'c:\arcemu\code\dep\include\libmpq_new\explode.h' : alignment changed after including header, may be due to missing #pragma pack(pop)
5>  extract.c
5>  huffman.c
5>C:\arcemu\code\dep\include\libmpq_new\mpq-internal.h(69): warning C4103: 'c:\arcemu\code\dep\include\libmpq_new\mpq-internal.h' : alignment changed after including header, may be due to missing #pragma pack(pop)
5>C:\arcemu\code\dep\include\libmpq_new\mpq-internal.h(124): warning C4103: 'c:\arcemu\code\dep\include\libmpq_new\mpq-internal.h' : alignment changed after including header, may be due to missing #pragma pack(pop)
5>  mpq.c
5>  wave.c
3>  Box.cpp
5>C:\arcemu\code\dep\include\libmpq_new\mpq-internal.h(69): warning C4103: 'c:\arcemu\code\dep\include\libmpq_new\mpq-internal.h' : alignment changed after including header, may be due to missing #pragma pack(pop)
5>C:\arcemu\code\dep\include\libmpq_new\mpq-internal.h(124): warning C4103: 'c:\arcemu\code\dep\include\libmpq_new\mpq-internal.h' : alignment changed after including header, may be due to missing #pragma pack(pop)
5>..\..\..\code\dep\src\libmpq_new\mpq.c(145): warning C4244: '=' : conversion from 'libmpq__off_t' to 'off_t', possible loss of data
5>..\..\..\code\dep\src\libmpq_new\mpq.c(976): warning C4244: 'function' : conversion from 'libmpq__off_t' to 'uint32_t', possible loss of data
5>..\..\..\code\dep\src\libmpq_new\mpq.c(993): warning C4244: 'function' : conversion from 'libmpq__off_t' to 'uint32_t', possible loss of data
5>..\..\..\code\dep\src\libmpq_new\mpq.c(1007): warning C4244: 'function' : conversion from 'libmpq__off_t' to 'uint32_t', possible loss of data
5>..\..\..\code\dep\src\libmpq_new\wave.c(86): warning C4018: '<' : signed/unsigned mismatch
5>  mpq_libmpq.cpp
5>C:\arcemu\code\dep\include\libmpq_new\mpq_libmpq04.h(2): warning C4005: '_CRT_SECURE_NO_WARNINGS' : macro redefinition
5>          command-line arguments :  see previous definition of '_CRT_SECURE_NO_WARNINGS'
3>  Capsule.cpp
5>C:\arcemu\code\dep\include\libmpq_new\mpq_libmpq04.h(32): warning C4244: 'initializing' : conversion from 'libmpq__off_t' to 'unsigned int', possible loss of data
5>C:\arcemu\code\dep\include\libmpq_new\mpq_libmpq04.h(70): warning C4244: 'return' : conversion from 'libmpq__off_t' to 'size_t', possible loss of data
5>C:\arcemu\code\dep\include\libmpq_new\mpq_libmpq04.h(71): warning C4244: 'return' : conversion from 'libmpq__off_t' to 'size_t', possible loss of data
5>..\..\..\code\dep\src\libmpq_new\mpq_libmpq.cpp(65): warning C4244: 'initializing' : conversion from 'libmpq__off_t' to 'unsigned int', possible loss of data
5>..\..\..\code\dep\src\libmpq_new\mpq_libmpq.cpp(81): warning C4244: 'initializing' : conversion from 'libmpq__off_t' to 'size_t', possible loss of data
5>..\..\..\code\dep\src\libmpq_new\mpq_libmpq.cpp(83): warning C4244: '=' : conversion from 'libmpq__off_t' to 'size_t', possible loss of data
3>  CollisionDetection.cpp
5>  libmpq_new.vcxproj -> C:\arcemu\build\tools\libmpq_new\Debug\libmpq_new.lib
6>------ Build started: Project: shared, Configuration: Debug Win32 ------
6>  Building Custom Rule C:/arcemu/code/cmake/shared/CMakeLists.txt
6>  CMake does not need to re-run because C:\arcemu\build\shared\CMakeFiles\generate.stamp is up-to-date.
6>  CThreads.cpp
6>  CrashHandler.cpp
3>  CoordinateFrame.cpp
3>  Crypto.cpp
6>  Log.cpp
3>  Cylinder.cpp
3>  debugAssert.cpp
6>  MersenneTwister.cpp
6>  printStackTrace.cpp
3>  fileutils.cpp
3>  format.cpp
6>  Util.cpp
6>  crc32.cpp
6>  MapFile.cpp
3>  g3dfnmatch.cpp
3>  g3dmath.cpp
3>  Line.cpp
3>  LineSegment.cpp
6>  MapFileEntry.cpp
6>  TextFile.cpp
6>  FindFiles.cpp
6>  DynLib.cpp
3>  Log.cpp
6>  SysInfo.cpp
3>  Matrix.cpp
3>  Matrix3.cpp
6>  PerformanceCounter.cpp
6>  Mutex.cpp
6>  ThreadPool.cpp
3>  Matrix4.cpp
3>  MemoryManager.cpp
6>  AtomicULong.cpp
6>  AtomicFloat.cpp
3>  Plane.cpp
6>  AtomicCounter.cpp
3>  prompt.cpp
6>  AtomicBoolean.cpp
3>  Quat.cpp
6>  ConditionVariable.cpp
3>  Random.cpp
3>  Ray.cpp
6>  arcemu_getopt.cpp
6>  BigNumber.cpp
3>  ReferenceCount.cpp
3>  RegistryUtil.cpp
6>  MD5.cpp
6>  Sha1.cpp
3>  Sphere.cpp
3>  stringutils.cpp
6>  WowCrypt.cpp
3>  System.cpp
3>  TextInput.cpp
6>  Config.cpp
6>  Database.cpp
3>  Port System::memcpy SIMD to all platforms
3>  Port System::memfill SIMD to all platforms
3>  TextOutput.cpp
6>  MySQLDatabase.cpp
3>  Triangle.cpp
3>  UprightFrame.cpp
6>  CreateInterface.cpp
6>  CircularBuffer.cpp
3>  Vector2.cpp
3>  Vector3.cpp
6>  Socket.cpp
6>  SocketMgrWin32.cpp
3>  Vector4.cpp
6>  SocketOpsWin32.cpp
6>  SocketWin32.cpp
6>  StackWalker.cpp
6>  StackTrace.cpp
3>  g3dlite.vcxproj -> C:\arcemu\build\g3dlite\Debug\g3dlite.lib
7>------ Build started: Project: recast, Configuration: Debug Win32 ------
7>  Building Custom Rule C:/arcemu/code/cmake/recast/CMakeLists.txt
7>  CMake does not need to re-run because C:\arcemu\build\recast\CMakeFiles\generate.stamp is up-to-date.
7>  Recast.cpp
7>  RecastAlloc.cpp
7>  RecastArea.cpp
7>  RecastContour.cpp
7>  RecastFilter.cpp
7>  RecastMesh.cpp
7>  RecastMeshDetail.cpp
6>  shared.vcxproj -> C:\arcemu\build\shared\Debug\shared.lib
7>  RecastRasterization.cpp
7>  RecastRegion.cpp
8>------ Build started: Project: pcre, Configuration: Debug Win32 ------
8>  Building Custom Rule C:/arcemu/code/cmake/pcre/CMakeLists.txt
8>  CMake does not need to re-run because C:\arcemu\build\pcre\CMakeFiles\generate.stamp is up-to-date.
8>  pcre_chartables.c
8>  pcre_compile.c
8>  pcre_config.c
7>  recast.vcxproj -> C:\arcemu\build\recast\Debug\recast.lib
8>  pcre_dfa_exec.c
9>------ Build started: Project: vmaplib, Configuration: Debug Win32 ------
8>  pcre_exec.c
9>  Building Custom Rule C:/arcemu/code/cmake/vmaplib/CMakeLists.txt
9>  CMake does not need to re-run because C:\arcemu\build\vmaplib\CMakeFiles\generate.stamp is up-to-date.
8>  pcre_fullinfo.c
8>  pcre_get.c
8>  pcre_globals.c
8>  pcre_info.c
8>  pcre_maketables.c
8>  pcre_newline.c
9>  BIH.cpp
9>  MapTree.cpp
8>  pcre_ord2utf8.c
8>  pcre_refcount.c
8>  pcre_study.c
8>  pcre_tables.c
8>  pcre_try_flipped.c
8>  pcre_ucp_searchfuncs.c
8>  pcre_valid_utf8.c
8>  pcre_version.c
8>  pcre_xclass.c
8>  pcre.vcxproj -> C:\arcemu\build\pcre\Debug\pcre.lib
10>------ Build started: Project: detour, Configuration: Debug Win32 ------
10>  Building Custom Rule C:/arcemu/code/cmake/detour/CMakeLists.txt
10>  CMake does not need to re-run because C:\arcemu\build\detour\CMakeFiles\generate.stamp is up-to-date.
10>  DetourAlloc.cpp
10>  DetourCommon.cpp
10>  DetourNavMesh.cpp
10>  DetourNavMeshBuilder.cpp
10>  DetourNavMeshQuery.cpp
10>  DetourNode.cpp
10>  DetourObstacleAvoidance.cpp
9>  ModelInstance.cpp
10>  detour.vcxproj -> C:\arcemu\build\detour\Debug\detour.lib
9>  TileAssembler.cpp
11>------ Build started: Project: dbcfile, Configuration: Debug Win32 ------
11>  Building Custom Rule C:/arcemu/code/cmake/tools/dbcfile/CMakeLists.txt
11>  CMake does not need to re-run because C:\arcemu\build\tools\dbcfile\CMakeFiles\generate.stamp is up-to-date.
11>  dbcfile.cpp
9>  VMapFactory.cpp
11>C:\arcemu\code\dep\include\libmpq_new\mpq_libmpq04.h(2): warning C4005: '_CRT_SECURE_NO_WARNINGS' : macro redefinition
11>          command-line arguments :  see previous definition of '_CRT_SECURE_NO_WARNINGS'
11>C:\arcemu\code\dep\include\libmpq_new\mpq_libmpq04.h(32): warning C4244: 'initializing' : conversion from 'libmpq__off_t' to 'unsigned int', possible loss of data
11>C:\arcemu\code\dep\include\libmpq_new\mpq_libmpq04.h(70): warning C4244: 'return' : conversion from 'libmpq__off_t' to 'size_t', possible loss of data
11>C:\arcemu\code\dep\include\libmpq_new\mpq_libmpq04.h(71): warning C4244: 'return' : conversion from 'libmpq__off_t' to 'size_t', possible loss of data
9>  VMapManager2.cpp
9>  WorldModel.cpp
11>  dbcfile.vcxproj -> C:\arcemu\build\tools\dbcfile\Debug\dbcfile.lib
12>------ Build started: Project: lualib, Configuration: Debug Win32 ------
12>  Building Custom Rule C:/arcemu/code/cmake/scripts/lualib/CMakeLists.txt
12>  CMake does not need to re-run because C:\arcemu\build\scripts\lualib\CMakeFiles\generate.stamp is up-to-date.
12>cl : Command line warning D9002: ignoring unknown option '-fPIC'
12>cl : Command line warning D9002: ignoring unknown option '-fPIC'
12>  lapi.c
12>cl : Command line warning D9002: ignoring unknown option '-fPIC'
12>  lauxlib.c
12>  lbaselib.c
12>  lcode.c
12>  ldblib.c
12>  ldebug.c
12>  ldo.c
12>  ldump.c
12>  lfunc.c
12>  lgc.c
12>  linit.c
12>  liolib.c
12>  llex.c
12>  lmathlib.c
12>  lmem.c
12>  loadlib.c
12>  lobject.c
9>  vmaplib.vcxproj -> C:\arcemu\build\vmaplib\Debug\vmaplib.lib
12>  lopcodes.c
12>  loslib.c
13>------ Build started: Project: loadlib, Configuration: Debug Win32 ------
13>  Building Custom Rule C:/arcemu/code/cmake/tools/loadlib/CMakeLists.txt
12>  lparser.c
13>  CMake does not need to re-run because C:\arcemu\build\tools\loadlib\CMakeFiles\generate.stamp is up-to-date.
12>  lstate.c
12>  lstring.c
13>  adt.cpp
13>  loadlib.cpp
12>  lstrlib.c
13>C:\arcemu\code\dep\include\libmpq_new\mpq_libmpq04.h(2): warning C4005: '_CRT_SECURE_NO_WARNINGS' : macro redefinition
13>          command-line arguments :  see previous definition of '_CRT_SECURE_NO_WARNINGS'
12>  ltable.c
13>  wdt.cpp
12>  ltablib.c
12>  ltm.c
12>  lua.c
12>  lundump.c
12>  lvm.c
12>  lzio.c
12>  print.c
13>C:\arcemu\code\dep\include\libmpq_new\mpq_libmpq04.h(32): warning C4244: 'initializing' : conversion from 'libmpq__off_t' to 'unsigned int', possible loss of data
13>C:\arcemu\code\dep\include\libmpq_new\mpq_libmpq04.h(70): warning C4244: 'return' : conversion from 'libmpq__off_t' to 'size_t', possible loss of data
13>C:\arcemu\code\dep\include\libmpq_new\mpq_libmpq04.h(71): warning C4244: 'return' : conversion from 'libmpq__off_t' to 'size_t', possible loss of data
12>  lualib.vcxproj -> C:\arcemu\build\scripts\lualib\Debug\lualib.lib
14>------ Build started: Project: world, Configuration: Debug Win32 ------
13>  loadlib.vcxproj -> C:\arcemu\build\tools\loadlib\Debug\loadlib.lib
14>  Building Custom Rule C:/arcemu/code/cmake/world/CMakeLists.txt
14>  CMake does not need to re-run because C:\arcemu\build\world\CMakeFiles\generate.stamp is up-to-date.
15>------ Build started: Project: creature_data, Configuration: Debug Win32 ------
14>  StdAfx.cpp
15>  Building Custom Rule C:/arcemu/code/cmake/tools/creature_data/CMakeLists.txt
15>  CMake does not need to re-run because C:\arcemu\build\tools\creature_data\CMakeFiles\generate.stamp is up-to-date.
15>  Main.cpp
15>C:\arcemu\code\dep\include\libmpq_new\mpq_libmpq04.h(2): warning C4005: '_CRT_SECURE_NO_WARNINGS' : macro redefinition
15>          command-line arguments :  see previous definition of '_CRT_SECURE_NO_WARNINGS'
15>C:\arcemu\code\dep\include\libmpq_new\mpq_libmpq04.h(32): warning C4244: 'initializing' : conversion from 'libmpq__off_t' to 'unsigned int', possible loss of data
15>C:\arcemu\code\dep\include\libmpq_new\mpq_libmpq04.h(70): warning C4244: 'return' : conversion from 'libmpq__off_t' to 'size_t', possible loss of data
15>C:\arcemu\code\dep\include\libmpq_new\mpq_libmpq04.h(71): warning C4244: 'return' : conversion from 'libmpq__off_t' to 'size_t', possible loss of data
15>  creature_data.vcxproj -> C:\arcemu\build\tools\creature_data\Debug\creature_data.exe
16>------ Build started: Project: vmap_extractor, Configuration: Debug Win32 ------
16>  Building Custom Rule C:/arcemu/code/cmake/tools/vmap_tools/vmap_extractor/CMakeLists.txt
16>  CMake does not need to re-run because C:\arcemu\build\tools\vmap_tools\vmap_extractor\CMakeFiles\generate.stamp is up-to-date.
16>  adtfile.cpp
16>  dbcfile.cpp
16>C:\arcemu\code\dep\include\libmpq_new\mpq_libmpq04.h(2): warning C4005: '_CRT_SECURE_NO_WARNINGS' : macro redefinition
16>          command-line arguments :  see previous definition of '_CRT_SECURE_NO_WARNINGS'
16>C:\arcemu\code\dep\include\libmpq_new\mpq_libmpq04.h(2): warning C4005: '_CRT_SECURE_NO_WARNINGS' : macro redefinition
16>          command-line arguments :  see previous definition of '_CRT_SECURE_NO_WARNINGS'
16>C:\arcemu\code\dep\include\libmpq_new\mpq_libmpq04.h(32): warning C4244: 'initializing' : conversion from 'libmpq__off_t' to 'unsigned int', possible loss of data
16>C:\arcemu\code\dep\include\libmpq_new\mpq_libmpq04.h(70): warning C4244: 'return' : conversion from 'libmpq__off_t' to 'size_t', possible loss of data
16>C:\arcemu\code\dep\include\libmpq_new\mpq_libmpq04.h(71): warning C4244: 'return' : conversion from 'libmpq__off_t' to 'size_t', possible loss of data
16>C:\arcemu\code\dep\include\libmpq_new\mpq_libmpq04.h(32): warning C4244: 'initializing' : conversion from 'libmpq__off_t' to 'unsigned int', possible loss of data
16>C:\arcemu\code\dep\include\libmpq_new\mpq_libmpq04.h(70): warning C4244: 'return' : conversion from 'libmpq__off_t' to 'size_t', possible loss of data
16>C:\arcemu\code\dep\include\libmpq_new\mpq_libmpq04.h(71): warning C4244: 'return' : conversion from 'libmpq__off_t' to 'size_t', possible loss of data
16>  model.cpp
16>  vmapexport.cpp
16>C:\arcemu\code\dep\include\libmpq_new\mpq_libmpq04.h(2): warning C4005: '_CRT_SECURE_NO_WARNINGS' : macro redefinition
16>          command-line arguments :  see previous definition of '_CRT_SECURE_NO_WARNINGS'
16>C:\arcemu\code\dep\include\libmpq_new\mpq_libmpq04.h(32): warning C4244: 'initializing' : conversion from 'libmpq__off_t' to 'unsigned int', possible loss of data
16>C:\arcemu\code\dep\include\libmpq_new\mpq_libmpq04.h(70): warning C4244: 'return' : conversion from 'libmpq__off_t' to 'size_t', possible loss of data
16>C:\arcemu\code\dep\include\libmpq_new\mpq_libmpq04.h(71): warning C4244: 'return' : conversion from 'libmpq__off_t' to 'size_t', possible loss of data
16>C:\arcemu\code\dep\include\libmpq_new\mpq_libmpq04.h(2): warning C4005: '_CRT_SECURE_NO_WARNINGS' : macro redefinition
16>          command-line arguments :  see previous definition of '_CRT_SECURE_NO_WARNINGS'
16>C:\arcemu\code\dep\include\libmpq_new\mpq_libmpq04.h(32): warning C4244: 'initializing' : conversion from 'libmpq__off_t' to 'unsigned int', possible loss of data
16>  wdtfile.cpp
16>C:\arcemu\code\dep\include\libmpq_new\mpq_libmpq04.h(70): warning C4244: 'return' : conversion from 'libmpq__off_t' to 'size_t', possible loss of data
16>C:\arcemu\code\dep\include\libmpq_new\mpq_libmpq04.h(71): warning C4244: 'return' : conversion from 'libmpq__off_t' to 'size_t', possible loss of data
16>C:\arcemu\code\dep\include\libmpq_new\mpq_libmpq04.h(2): warning C4005: '_CRT_SECURE_NO_WARNINGS' : macro redefinition
16>          command-line arguments :  see previous definition of '_CRT_SECURE_NO_WARNINGS'
16>..\..\..\..\code\src\tools\vmap_tools\vmap_extractor\vmapexport.cpp(485): warning C4800: 'int' : forcing value to bool 'true' or 'false' (performance warning)
16>C:\arcemu\code\dep\include\libmpq_new\mpq_libmpq04.h(32): warning C4244: 'initializing' : conversion from 'libmpq__off_t' to 'unsigned int', possible loss of data
16>C:\arcemu\code\dep\include\libmpq_new\mpq_libmpq04.h(70): warning C4244: 'return' : conversion from 'libmpq__off_t' to 'size_t', possible loss of data
16>C:\arcemu\code\dep\include\libmpq_new\mpq_libmpq04.h(71): warning C4244: 'return' : conversion from 'libmpq__off_t' to 'size_t', possible loss of data
16>  wmo.cpp
16>C:\arcemu\code\dep\include\libmpq_new\mpq_libmpq04.h(2): warning C4005: '_CRT_SECURE_NO_WARNINGS' : macro redefinition
16>          command-line arguments :  see previous definition of '_CRT_SECURE_NO_WARNINGS'
16>C:\arcemu\code\dep\include\libmpq_new\mpq_libmpq04.h(32): warning C4244: 'initializing' : conversion from 'libmpq__off_t' to 'unsigned int', possible loss of data
16>C:\arcemu\code\dep\include\libmpq_new\mpq_libmpq04.h(70): warning C4244: 'return' : conversion from 'libmpq__off_t' to 'size_t', possible loss of data
16>C:\arcemu\code\dep\include\libmpq_new\mpq_libmpq04.h(71): warning C4244: 'return' : conversion from 'libmpq__off_t' to 'size_t', possible loss of data
16>  vmap_extractor.vcxproj -> C:\arcemu\build\tools\vmap_tools\vmap_extractor\Debug\vmap_extractor.exe
17>------ Build started: Project: vmap_assembler, Configuration: Debug Win32 ------
17>  Building Custom Rule C:/arcemu/code/cmake/tools/vmap_tools/vmap_assembler/CMakeLists.txt
17>  CMake does not need to re-run because C:\arcemu\build\tools\vmap_tools\vmap_assembler\CMakeFiles\generate.stamp is up-to-date.
17>  vmap_assembler.cpp
17>  vmap_assembler.vcxproj -> C:\arcemu\build\tools\vmap_tools\vmap_assembler\Debug\vmap_assembler.exe
18>------ Build started: Project: ad, Configuration: Debug Win32 ------
18>  Building Custom Rule C:/arcemu/code/cmake/tools/ad/CMakeLists.txt
18>  CMake does not need to re-run because C:\arcemu\build\tools\ad\CMakeFiles\generate.stamp is up-to-date.
18>  System.cpp
18>C:\arcemu\code\dep\include\libmpq_new\mpq_libmpq04.h(2): warning C4005: '_CRT_SECURE_NO_WARNINGS' : macro redefinition
18>          command-line arguments :  see previous definition of '_CRT_SECURE_NO_WARNINGS'
18>C:\arcemu\code\dep\include\libmpq_new\mpq_libmpq04.h(32): warning C4244: 'initializing' : conversion from 'libmpq__off_t' to 'unsigned int', possible loss of data
18>C:\arcemu\code\dep\include\libmpq_new\mpq_libmpq04.h(70): warning C4244: 'return' : conversion from 'libmpq__off_t' to 'size_t', possible loss of data
18>C:\arcemu\code\dep\include\libmpq_new\mpq_libmpq04.h(71): warning C4244: 'return' : conversion from 'libmpq__off_t' to 'size_t', possible loss of data
18>  ad.vcxproj -> C:\arcemu\build\tools\ad\Debug\ad.exe
19>------ Build started: Project: logon, Configuration: Debug Win32 ------
19>  Building Custom Rule C:/arcemu/code/cmake/logon/CMakeLists.txt
19>  CMake does not need to re-run because C:\arcemu\build\logon\CMakeFiles\generate.stamp is up-to-date.
19>  LogonStdAfx.cpp
19>  AccountCache.cpp
19>  AuthSocket.cpp
19>  AutoPatcher.cpp
19>  LogonCommServer.cpp
19>  LogonConsole.cpp
19>  LogonOpcodes.cpp
19>  Main.cpp
19>     Creating library C:/arcemu/build/logon/Debug/logon.lib and object C:/arcemu/build/logon/Debug/logon.exp
19>AuthSocket.obj : error LNK2019: unresolved external symbol _MD5_Final referenced in function "public: void __thiscall AuthSocket::HandleReconnectChallenge(void)" (?HandleReconnectChallenge@AuthSocket@@QAEXXZ)
19>shared.lib(MD5.obj) : error LNK2001: unresolved external symbol _MD5_Final
19>AuthSocket.obj : error LNK2019: unresolved external symbol _MD5_Update referenced in function "public: void __thiscall AuthSocket::HandleReconnectChallenge(void)" (?HandleReconnectChallenge@AuthSocket@@QAEXXZ)
19>shared.lib(MD5.obj) : error LNK2001: unresolved external symbol _MD5_Update
19>AuthSocket.obj : error LNK2019: unresolved external symbol _MD5_Init referenced in function "public: void __thiscall AuthSocket::HandleReconnectChallenge(void)" (?HandleReconnectChallenge@AuthSocket@@QAEXXZ)
19>shared.lib(MD5.obj) : error LNK2001: unresolved external symbol _MD5_Init
19>shared.lib(Sha1.obj) : error LNK2019: unresolved external symbol _SHA1_Init referenced in function "public: __thiscall Sha1Hash::Sha1Hash(void)" (??0Sha1Hash@@QAE@XZ)
19>shared.lib(Sha1.obj) : error LNK2019: unresolved external symbol _SHA1_Update referenced in function "public: void __thiscall Sha1Hash::UpdateData(unsigned char const *,int)" (?UpdateData@Sha1Hash@@QAEXPBEH@Z)
19>shared.lib(Sha1.obj) : error LNK2019: unresolved external symbol _SHA1_Final referenced in function "public: void __thiscall Sha1Hash::Finalize(void)" (?Finalize@Sha1Hash@@QAEXXZ)
19>shared.lib(BigNumber.obj) : error LNK2019: unresolved external symbol _BN_new referenced in function "public: __thiscall BigNumber::BigNumber(void)" (??0BigNumber@@QAE@XZ)
19>shared.lib(BigNumber.obj) : error LNK2019: unresolved external symbol _BN_dup referenced in function "public: __thiscall BigNumber::BigNumber(class BigNumber const &)" (??0BigNumber@@QAE@ABV0@@Z)
19>shared.lib(BigNumber.obj) : error LNK2019: unresolved external symbol _BN_set_word referenced in function "public: __thiscall BigNumber::BigNumber(unsigned int)" (??0BigNumber@@QAE@I@Z)
19>shared.lib(BigNumber.obj) : error LNK2019: unresolved external symbol _BN_free referenced in function "public: __thiscall BigNumber::~BigNumber(void)" (??1BigNumber@@QAE@XZ)
19>shared.lib(BigNumber.obj) : error LNK2019: unresolved external symbol _BN_lshift referenced in function "public: void __thiscall BigNumber::SetQword(unsigned __int64)" (?SetQword@BigNumber@@QAEX_K@Z)
19>shared.lib(BigNumber.obj) : error LNK2019: unresolved external symbol _BN_add_word referenced in function "public: void __thiscall BigNumber::SetQword(unsigned __int64)" (?SetQword@BigNumber@@QAEX_K@Z)
19>shared.lib(BigNumber.obj) : error LNK2019: unresolved external symbol _BN_bin2bn referenced in function "public: void __thiscall BigNumber::SetBinary(unsigned char const *,int)" (?SetBinary@BigNumber@@QAEXPBEH@Z)
19>shared.lib(BigNumber.obj) : error LNK2019: unresolved external symbol _BN_hex2bn referenced in function "public: void __thiscall BigNumber::SetHexStr(char const *)" (?SetHexStr@BigNumber@@QAEXPBD@Z)
19>shared.lib(BigNumber.obj) : error LNK2019: unresolved external symbol _BN_rand referenced in function "public: void __thiscall BigNumber::SetRand(int)" (?SetRand@BigNumber@@QAEXH@Z)
19>shared.lib(BigNumber.obj) : error LNK2019: unresolved external symbol _BN_copy referenced in function "public: class BigNumber __thiscall BigNumber::operator=(class BigNumber const &)" (??4BigNumber@@QAE?AV0@ABV0@@Z)
19>shared.lib(BigNumber.obj) : error LNK2019: unresolved external symbol _BN_add referenced in function "public: class BigNumber __thiscall BigNumber::operator+=(class BigNumber const &)" (??YBigNumber@@QAE?AV0@ABV0@@Z)
19>shared.lib(BigNumber.obj) : error LNK2019: unresolved external symbol _BN_sub referenced in function "public: class BigNumber __thiscall BigNumber::operator-=(class BigNumber const &)" (??ZBigNumber@@QAE?AV0@ABV0@@Z)
19>shared.lib(BigNumber.obj) : error LNK2019: unresolved external symbol _BN_CTX_free referenced in function "public: class BigNumber __thiscall BigNumber::operator*=(class BigNumber const &)" (??XBigNumber@@QAE?AV0@ABV0@@Z)
19>shared.lib(BigNumber.obj) : error LNK2019: unresolved external symbol _BN_mul referenced in function "public: class BigNumber __thiscall BigNumber::operator*=(class BigNumber const &)" (??XBigNumber@@QAE?AV0@ABV0@@Z)
19>shared.lib(BigNumber.obj) : error LNK2019: unresolved external symbol _BN_CTX_new referenced in function "public: class BigNumber __thiscall BigNumber::operator*=(class BigNumber const &)" (??XBigNumber@@QAE?AV0@ABV0@@Z)
19>shared.lib(BigNumber.obj) : error LNK2019: unresolved external symbol _BN_div referenced in function "public: class BigNumber __thiscall BigNumber::operator/=(class BigNumber const &)" (??_0BigNumber@@QAE?AV0@ABV0@@Z)
19>shared.lib(BigNumber.obj) : error LNK2019: unresolved external symbol _BN_exp referenced in function "public: class BigNumber __thiscall BigNumber::Exp(class BigNumber const &)" (?Exp@BigNumber@@QAE?AV1@ABV1@@Z)
19>shared.lib(BigNumber.obj) : error LNK2019: unresolved external symbol _BN_mod_exp referenced in function "public: class BigNumber __thiscall BigNumber::ModExp(class BigNumber const &,class BigNumber const &)" (?ModExp@BigNumber@@QAE?AV1@ABV1@0@Z)
19>shared.lib(BigNumber.obj) : error LNK2019: unresolved external symbol _BN_num_bits referenced in function "public: int __thiscall BigNumber::GetNumBytes(void)" (?GetNumBytes@BigNumber@@QAEHXZ)
19>shared.lib(BigNumber.obj) : error LNK2019: unresolved external symbol _BN_get_word referenced in function "public: unsigned int __thiscall BigNumber::AsDword(void)" (?AsDword@BigNumber@@QAEIXZ)
19>shared.lib(BigNumber.obj) : error LNK2019: unresolved external symbol _BN_bn2bin referenced in function "public: unsigned char * __thiscall BigNumber::AsByteArray(void)" (?AsByteArray@BigNumber@@QAEPAEXZ)
19>shared.lib(BigNumber.obj) : error LNK2019: unresolved external symbol _BN_bn2hex referenced in function "public: char const * __thiscall BigNumber::AsHexStr(void)" (?AsHexStr@BigNumber@@QAEPBDXZ)
19>shared.lib(BigNumber.obj) : error LNK2019: unresolved external symbol _BN_bn2dec referenced in function "public: char const * __thiscall BigNumber::AsDecStr(void)" (?AsDecStr@BigNumber@@QAEPBDXZ)
19>shared.lib(CreateInterface.obj) : error LNK2019: unresolved external symbol _mysql_server_end@0 referenced in function "public: static void __cdecl Database::CleanupLibs(void)" (?CleanupLibs@Database@@SAXXZ)
19>shared.lib(MySQLDatabase.obj) : error LNK2001: unresolved external symbol _mysql_server_end@0
19>shared.lib(MySQLDatabase.obj) : error LNK2019: unresolved external symbol _mysql_close@4 referenced in function "public: virtual __thiscall MySQLDatabase::~MySQLDatabase(void)" (??1MySQLDatabase@@UAE@XZ)
19>shared.lib(MySQLDatabase.obj) : error LNK2019: unresolved external symbol _mysql_error@4 referenced in function "public: virtual bool __thiscall MySQLDatabase::Initialize(char const *,unsigned int,char const *,char const *,char const *,unsigned int,unsigned int)" (?Initialize@MySQLDatabase@@UAE_NPBDI000II@Z)
19>shared.lib(MySQLDatabase.obj) : error LNK2019: unresolved external symbol _mysql_real_connect@32 referenced in function "public: virtual bool __thiscall MySQLDatabase::Initialize(char const *,unsigned int,char const *,char const *,char const *,unsigned int,unsigned int)" (?Initialize@MySQLDatabase@@UAE_NPBDI000II@Z)
19>shared.lib(MySQLDatabase.obj) : error LNK2019: unresolved external symbol _mysql_options@12 referenced in function "public: virtual bool __thiscall MySQLDatabase::Initialize(char const *,unsigned int,char const *,char const *,char const *,unsigned int,unsigned int)" (?Initialize@MySQLDatabase@@UAE_NPBDI000II@Z)
19>shared.lib(MySQLDatabase.obj) : error LNK2019: unresolved external symbol _mysql_init@4 referenced in function "public: virtual bool __thiscall MySQLDatabase::Initialize(char const *,unsigned int,char const *,char const *,char const *,unsigned int,unsigned int)" (?Initialize@MySQLDatabase@@UAE_NPBDI000II@Z)
19>shared.lib(MySQLDatabase.obj) : error LNK2019: unresolved external symbol _mysql_real_escape_string@16 referenced in function "public: virtual class std::basic_string<char,struct std::char_traits<char>,class std::allocator<char> > __thiscall MySQLDatabase::EscapeString(class std::basic_string<char,struct std::char_traits<char>,class std::allocator<char> >)" (?EscapeString@MySQLDatabase@@UAE?AV?$basic_string@DU?$char_traits@D@std@@V?$allocator@D@2@@std@@V23@@Z)
19>shared.lib(MySQLDatabase.obj) : error LNK2019: unresolved external symbol _mysql_errno@4 referenced in function "protected: virtual bool __thiscall MySQLDatabase::_SendQuery(struct DatabaseConnection *,char const *,bool)" (?_SendQuery@MySQLDatabase@@MAE_NPAUDatabaseConnection@@PBD_N@Z)
19>shared.lib(MySQLDatabase.obj) : error LNK2019: unresolved external symbol _mysql_query@8 referenced in function "protected: virtual bool __thiscall MySQLDatabase::_SendQuery(struct DatabaseConnection *,char const *,bool)" (?_SendQuery@MySQLDatabase@@MAE_NPAUDatabaseConnection@@PBD_N@Z)
19>shared.lib(MySQLDatabase.obj) : error LNK2019: unresolved external symbol _mysql_free_result@4 referenced in function "public: virtual __thiscall MySQLQueryResult::~MySQLQueryResult(void)" (??1MySQLQueryResult@@UAE@XZ)
19>shared.lib(MySQLDatabase.obj) : error LNK2019: unresolved external symbol _mysql_fetch_row@4 referenced in function "public: virtual bool __thiscall MySQLQueryResult::NextRow(void)" (?NextRow@MySQLQueryResult@@UAE_NXZ)
19>shared.lib(MySQLDatabase.obj) : error LNK2019: unresolved external symbol _mysql_field_count@4 referenced in function "protected: virtual class QueryResult * __thiscall MySQLDatabase::_StoreQueryResult(struct DatabaseConnection *)" (?_StoreQueryResult@MySQLDatabase@@MAEPAVQueryResult@@PAUDatabaseConnection@@@Z)
19>shared.lib(MySQLDatabase.obj) : error LNK2019: unresolved external symbol _mysql_affected_rows@4 referenced in function "protected: virtual class QueryResult * __thiscall MySQLDatabase::_StoreQueryResult(struct DatabaseConnection *)" (?_StoreQueryResult@MySQLDatabase@@MAEPAVQueryResult@@PAUDatabaseConnection@@@Z)
19>shared.lib(MySQLDatabase.obj) : error LNK2019: unresolved external symbol _mysql_store_result@4 referenced in function "protected: virtual class QueryResult * __thiscall MySQLDatabase::_StoreQueryResult(struct DatabaseConnection *)" (?_StoreQueryResult@MySQLDatabase@@MAEPAVQueryResult@@PAUDatabaseConnection@@@Z)
19>C:\arcemu\build\logon\Debug\logon.exe : fatal error LNK1120: 43 unresolved externals
14>C:\Program Files (x86)\Microsoft Visual Studio 10.0\VC\include\vector(212): error C3859: virtual memory range for PCH exceeded; please recompile with a command line option of '-Zm209' or greater
14>C:\Program Files (x86)\Microsoft Visual Studio 10.0\VC\include\vector(212): fatal error C1076: compiler limit : internal heap limit reached; use /Zm to specify a higher limit
20>------ Build started: Project: SpellHandlers, Configuration: Debug Win32 ------
21>------ Build started: Project: ServerStatusPlugin, Configuration: Debug Win32 ------
20>  Building Custom Rule C:/arcemu/code/cmake/spellhandlers/CMakeLists.txt
21>  Building Custom Rule C:/arcemu/code/cmake/scripts/serverstatusplugin/CMakeLists.txt
20>  CMake does not need to re-run because C:\arcemu\build\spellhandlers\CMakeFiles\generate.stamp is up-to-date.
21>  CMake does not need to re-run because C:\arcemu\build\scripts\serverstatusplugin\CMakeFiles\generate.stamp is up-to-date.
20>  Setup.cpp
21>  ServerStatusPlugin.cpp
21>LINK : fatal error LNK1104: cannot open file '..\..\world\Debug\world.lib'
20>C:\Program Files (x86)\Microsoft Visual Studio 10.0\VC\include\xmemory(201): error C3859: virtual memory range for PCH exceeded; please recompile with a command line option of '-Zm155' or greater
20>C:\Program Files (x86)\Microsoft Visual Studio 10.0\VC\include\xmemory(201): fatal error C1076: compiler limit : internal heap limit reached; use /Zm to specify a higher limit
22>------ Build started: Project: QuestScripts, Configuration: Debug Win32 ------
22>  Building Custom Rule C:/arcemu/code/cmake/scripts/questscripts/CMakeLists.txt
22>  CMake does not need to re-run because C:\arcemu\build\scripts\questscripts\CMakeFiles\generate.stamp is up-to-date.
23>------ Build started: Project: MiscScripts, Configuration: Debug Win32 ------
22>  Setup.cpp
23>  Building Custom Rule C:/arcemu/code/cmake/scripts/miscscripts/CMakeLists.txt
23>  CMake does not need to re-run because C:\arcemu\build\scripts\miscscripts\CMakeFiles\generate.stamp is up-to-date.
23>  Setup.cpp
23>C:\Program Files (x86)\Microsoft Visual Studio 10.0\VC\include\xmemory(201): error C3859: virtual memory range for PCH exceeded; please recompile with a command line option of '-Zm155' or greater
23>C:\Program Files (x86)\Microsoft Visual Studio 10.0\VC\include\xmemory(201): fatal error C1076: compiler limit : internal heap limit reached; use /Zm to specify a higher limit
22>C:\Program Files (x86)\Microsoft Visual Studio 10.0\VC\include\xmemory(201): error C3859: virtual memory range for PCH exceeded; please recompile with a command line option of '-Zm157' or greater
22>C:\Program Files (x86)\Microsoft Visual Studio 10.0\VC\include\xmemory(201): fatal error C1076: compiler limit : internal heap limit reached; use /Zm to specify a higher limit
24>------ Build started: Project: LuaEngine, Configuration: Debug Win32 ------
24>  Building Custom Rule C:/arcemu/code/cmake/scripts/luaengine/CMakeLists.txt
24>  CMake does not need to re-run because C:\arcemu\build\scripts\luaengine\CMakeFiles\generate.stamp is up-to-date.
25>------ Build started: Project: InstanceScripts, Configuration: Debug Win32 ------
24>  LUAEngine.cpp
25>  Building Custom Rule C:/arcemu/code/cmake/scripts/instancescripts/CMakeLists.txt
25>  CMake does not need to re-run because C:\arcemu\build\scripts\instancescripts\CMakeFiles\generate.stamp is up-to-date.
25>  Setup.cpp
25>C:\Program Files (x86)\Microsoft Visual Studio 10.0\VC\include\xmemory(201): error C3859: virtual memory range for PCH exceeded; please recompile with a command line option of '-Zm157' or greater
25>C:\Program Files (x86)\Microsoft Visual Studio 10.0\VC\include\xmemory(201): fatal error C1076: compiler limit : internal heap limit reached; use /Zm to specify a higher limit
26>------ Build started: Project: Battlegrounds, Configuration: Debug Win32 ------
26>  Building Custom Rule C:/arcemu/code/cmake/battlegrounds/CMakeLists.txt
26>  CMake does not need to re-run because C:\arcemu\build\battlegrounds\CMakeFiles\generate.stamp is up-to-date.
26>  Setup.cpp
24>LINK : fatal error LNK1104: cannot open file '..\..\world\Debug\world.lib'
27>------ Build started: Project: GossipScripts, Configuration: Debug Win32 ------
27>  Building Custom Rule C:/arcemu/code/cmake/scripts/gossipscripts/CMakeLists.txt
27>  CMake does not need to re-run because C:\arcemu\build\scripts\gossipscripts\CMakeFiles\generate.stamp is up-to-date.
27>  Setup.cpp
26>C:\Program Files (x86)\Microsoft Visual Studio 10.0\VC\include\xmemory(201): error C3859: virtual memory range for PCH exceeded; please recompile with a command line option of '-Zm155' or greater
26>C:\Program Files (x86)\Microsoft Visual Studio 10.0\VC\include\xmemory(201): fatal error C1076: compiler limit : internal heap limit reached; use /Zm to specify a higher limit
28>------ Build started: Project: ExtraScripts, Configuration: Debug Win32 ------
28>  Building Custom Rule C:/arcemu/code/cmake/scripts/extrascripts/CMakeLists.txt
28>  CMake does not need to re-run because C:\arcemu\build\scripts\extrascripts\CMakeFiles\generate.stamp is up-to-date.
28>  Setup.cpp
27>C:\Program Files (x86)\Microsoft Visual Studio 10.0\VC\include\xmemory(201): error C3859: virtual memory range for PCH exceeded; please recompile with a command line option of '-Zm155' or greater
27>C:\Program Files (x86)\Microsoft Visual Studio 10.0\VC\include\xmemory(201): fatal error C1076: compiler limit : internal heap limit reached; use /Zm to specify a higher limit
29>------ Build started: Project: EventScripts, Configuration: Debug Win32 ------
29>  Building Custom Rule C:/arcemu/code/cmake/scripts/eventscripts/CMakeLists.txt
29>  CMake does not need to re-run because C:\arcemu\build\scripts\eventscripts\CMakeFiles\generate.stamp is up-to-date.
29>  Setup.cpp
28>C:\Program Files (x86)\Microsoft Visual Studio 10.0\VC\include\xmemory(201): error C3859: virtual memory range for PCH exceeded; please recompile with a command line option of '-Zm155' or greater
28>C:\Program Files (x86)\Microsoft Visual Studio 10.0\VC\include\xmemory(201): fatal error C1076: compiler limit : internal heap limit reached; use /Zm to specify a higher limit
29>C:\Program Files (x86)\Microsoft Visual Studio 10.0\VC\include\xmemory(201): error C3859: virtual memory range for PCH exceeded; please recompile with a command line option of '-Zm157' or greater
29>C:\Program Files (x86)\Microsoft Visual Studio 10.0\VC\include\xmemory(201): fatal error C1076: compiler limit : internal heap limit reached; use /Zm to specify a higher limit
30>------ Build started: Project: ALL_BUILD, Configuration: Debug Win32 ------
30>  Building Custom Rule C:/arcemu/code/cmake/CMakeLists.txt
30>  CMake does not need to re-run because C:\arcemu\build\CMakeFiles\generate.stamp is up-to-date.
30>  Build all projects
========== Build: 18 succeeded, 12 failed, 0 up-to-date, 0 skipped ==========

0

#2 User is offline   dfighter 

  • Titles are overrated
  • PipPipPipPipPipPipPipPipPipPip
  • Group: Administrator
  • Posts: 5,189
  • Joined: 14-June 08
  • IRC:dfighter
  • Gender:Male
  • Server OS:Linux

Posted 15 May 2013 - 12:20 PM

Try higher then.
It's weird nevertheless.
Also make sure to configure and generate too after changing the heap limit!
"The demand for free goods is infinite."
0

Share this topic:


Page 1 of 1
  • You cannot start a new topic
  • You cannot reply to this topic

1 User(s) are reading this topic
0 members, 1 guests, 0 anonymous users