ArcEmu: Compiling Arcemu.sln Error - ArcEmu

Jump to content

Toggle shoutbox Lastest Announcements

dfighter  : (07 December 2014 - 12:06 PM) Arcemu is in hibernation mode, please read http://arcemu.org/fo...showtopic=26903
dfighter  : (01 January 2013 - 05:56 PM) Arcemu wishes you all a happy new year!
Hasbro  : (12 September 2012 - 10:01 AM) Please excuse our outage from the web! Our web host had a major malfunction!
dfighter  : (01 September 2012 - 04:05 PM) Since the spam bots just don't want to stop, I've enabled admin verification when registering.
dfighter  : (23 January 2012 - 09:56 PM) Please note that from now on you will need to confirm your email on the wiki in order to edit it!
Hasbro  : (31 December 2011 - 12:50 PM) Happy New Years all!
Navid  : (26 December 2011 - 04:09 AM) Merry Christmas !!!!!! Happy holidays all :)
WAmadeus  : (24 December 2011 - 03:54 PM) Merry Christmas to all!
dfighter  : (24 December 2011 - 11:05 AM) The Arcemu team wishes y'all a Merry Christmukkah!
Hasbro  : (05 October 2011 - 12:53 PM) Looking for web designers for upcoming web related project. If you're interested in designing user interfaces contact me
dfighter  : (02 September 2011 - 03:47 PM) So who here wants vehicles in Arcemu? :P http://arcemu.org/fo...showtopic=25440
Hasbro  : (14 August 2011 - 03:25 PM) Join us on irc, grab an irc client and connect to irc.freenode.net join channel #arcemu /server irc.freenode.net:6667 /join #arcemu
jackpoz  : (03 August 2011 - 05:33 AM) to all Lua Engine (old one) users: please check http://arcemu.org/fo...showtopic=25274
Hasbro  : (20 May 2011 - 05:27 PM) Looking for people experienced with CMake configuration and setup! Contact me asap
Hasbro  : (15 May 2011 - 05:03 PM) ArcEmu is recruiting C++ programmers, contact Hasbro if interested.
paroxysm  : (03 May 2011 - 06:26 PM) Updated luabridge gossip example to describe the whole gossip creation process rather than just how to create menu. Gossip tutorial
paroxysm  : (23 April 2011 - 11:35 AM) Lua writers can refer to the Luabridge Tutorials section in the Wiki to learn how to write gossip code correctly.
Hasbro  : (20 April 2011 - 05:22 PM) Thank you for your continuous contribution of bug reports, we are working on them.
Hasbro  : (17 April 2011 - 03:20 AM) Please consider donating to support our bills. Donations can be sent using PayPal to donations@arcemu.org - Thank you for your support.
paroxysm  : (10 April 2011 - 12:43 AM) Refer to the Luabridge Tutorials section in the Wiki to learn the new syntax of luabridge.
Resize Shouts Area

Page 1 of 1
  • You cannot start a new topic
  • You cannot reply to this topic

Compiling Arcemu.sln Error

#1 User is offline   Linspire 

  • Newbie
  • Group: Members
  • Posts: 4
  • Joined: 29-May 12
  • Gender:Male
  • Server OS:Windows

Posted 04 June 2012 - 10:26 AM

Hi seniors,

I have follow ArcEmu Wiki until the steps of compiling.

I have set my CMAKE configure options for VS 10. I used microsoft studio C++ 2010 express to compile Arcemu.sln.
In the end of my compile result was shown below :

1>------ Rebuild All started: Project: ZERO_CHECK, Configuration: Debug Win32 ------
1>  Checking Build System
1>  CMake does not need to re-run because F:/build/CMakeFiles/generate.stamp is up-to-date.
1>  CMake does not need to re-run because F:/build/zlib/CMakeFiles/generate.stamp is up-to-date.
1>  CMake does not need to re-run because F:/build/pcre/CMakeFiles/generate.stamp is up-to-date.
1>  CMake does not need to re-run because F:/build/g3dlite/CMakeFiles/generate.stamp is up-to-date.
1>  CMake does not need to re-run because F:/build/vmaplib/CMakeFiles/generate.stamp is up-to-date.
1>  CMake does not need to re-run because F:/build/recast/CMakeFiles/generate.stamp is up-to-date.
1>  CMake does not need to re-run because F:/build/detour/CMakeFiles/generate.stamp is up-to-date.
1>  CMake does not need to re-run because F:/build/shared/CMakeFiles/generate.stamp is up-to-date.
1>  CMake does not need to re-run because F:/build/logon/CMakeFiles/generate.stamp is up-to-date.
1>  CMake does not need to re-run because F:/build/world/CMakeFiles/generate.stamp is up-to-date.
1>  CMake does not need to re-run because F:/build/spellhandlers/CMakeFiles/generate.stamp is up-to-date.
1>  CMake does not need to re-run because F:/build/battlegrounds/CMakeFiles/generate.stamp is up-to-date.
1>  CMake does not need to re-run because F:/build/scripts/CMakeFiles/generate.stamp is up-to-date.
1>  CMake does not need to re-run because F:/build/scripts/eventscripts/CMakeFiles/generate.stamp is up-to-date.
1>  CMake does not need to re-run because F:/build/scripts/instancescripts/CMakeFiles/generate.stamp is up-to-date.
1>  CMake does not need to re-run because F:/build/scripts/extrascripts/CMakeFiles/generate.stamp is up-to-date.
1>  CMake does not need to re-run because F:/build/scripts/gossipscripts/CMakeFiles/generate.stamp is up-to-date.
1>  CMake does not need to re-run because F:/build/scripts/questscripts/CMakeFiles/generate.stamp is up-to-date.
1>  CMake does not need to re-run because F:/build/scripts/miscscripts/CMakeFiles/generate.stamp is up-to-date.
1>  CMake does not need to re-run because F:/build/scripts/serverstatusplugin/CMakeFiles/generate.stamp is up-to-date.
1>  CMake does not need to re-run because F:/build/scripts/lualib/CMakeFiles/generate.stamp is up-to-date.
1>  CMake does not need to re-run because F:/build/scripts/luabridge/CMakeFiles/generate.stamp is up-to-date.
1>  CMake does not need to re-run because F:/build/scripts/luaengine/CMakeFiles/generate.stamp is up-to-date.
1>  CMake does not need to re-run because F:/build/tools/CMakeFiles/generate.stamp is up-to-date.
1>  CMake does not need to re-run because F:/build/tools/bzip2/CMakeFiles/generate.stamp is up-to-date.
1>  CMake does not need to re-run because F:/build/tools/libmpq_new/CMakeFiles/generate.stamp is up-to-date.
1>  CMake does not need to re-run because F:/build/tools/dbcfile/CMakeFiles/generate.stamp is up-to-date.
1>  CMake does not need to re-run because F:/build/tools/loadlib/CMakeFiles/generate.stamp is up-to-date.
1>  CMake does not need to re-run because F:/build/tools/ad/CMakeFiles/generate.stamp is up-to-date.
1>  CMake does not need to re-run because F:/build/tools/creature_data/CMakeFiles/generate.stamp is up-to-date.
1>  CMake does not need to re-run because F:/build/tools/vmap_tools/CMakeFiles/generate.stamp is up-to-date.
1>  CMake does not need to re-run because F:/build/tools/vmap_tools/vmap_extractor/CMakeFiles/generate.stamp is up-to-date.
1>  CMake does not need to re-run because F:/build/tools/vmap_tools/vmap_assembler/CMakeFiles/generate.stamp is up-to-date.
2>------ Rebuild All started: Project: bzip2, Configuration: Debug Win32 ------
3>------ Rebuild All started: Project: g3dlite, Configuration: Debug Win32 ------
4>------ Rebuild All started: Project: zlib, Configuration: Debug Win32 ------
5>------ Rebuild All started: Project: recast, Configuration: Debug Win32 ------
6>------ Rebuild All started: Project: pcre, Configuration: Debug Win32 ------
7>------ Rebuild All started: Project: detour, Configuration: Debug Win32 ------
3>  Building Custom Rule F:/arcemu-arcemu-5f9054b/arcemu-arcemu-5f9054b/cmake/g3dlite/CMakeLists.txt
3>  CMake does not need to re-run because F:\build\g3dlite\CMakeFiles\generate.stamp is up-to-date.
4>  Building Custom Rule F:/arcemu-arcemu-5f9054b/arcemu-arcemu-5f9054b/cmake/zlib/CMakeLists.txt
2>  Building Custom Rule F:/arcemu-arcemu-5f9054b/arcemu-arcemu-5f9054b/cmake/tools/bzip2/CMakeLists.txt
5>  Building Custom Rule F:/arcemu-arcemu-5f9054b/arcemu-arcemu-5f9054b/cmake/recast/CMakeLists.txt
6>  Building Custom Rule F:/arcemu-arcemu-5f9054b/arcemu-arcemu-5f9054b/cmake/pcre/CMakeLists.txt
2>  CMake does not need to re-run because F:\build\tools\bzip2\CMakeFiles\generate.stamp is up-to-date.
4>  CMake does not need to re-run because F:\build\zlib\CMakeFiles\generate.stamp is up-to-date.
5>  CMake does not need to re-run because F:\build\recast\CMakeFiles\generate.stamp is up-to-date.
6>  CMake does not need to re-run because F:\build\pcre\CMakeFiles\generate.stamp is up-to-date.
3>  AABox.cpp
7>  Building Custom Rule F:/arcemu-arcemu-5f9054b/arcemu-arcemu-5f9054b/cmake/detour/CMakeLists.txt
3>  Any.cpp
3>  BinaryFormat.cpp
3>  BinaryInput.cpp
3>  BinaryOutput.cpp
3>  Box.cpp
5>  Recast.cpp
5>  RecastAlloc.cpp
5>  RecastArea.cpp
5>  RecastContour.cpp
5>  RecastFilter.cpp
4>  adler32.c
7>  CMake does not need to re-run because F:\build\detour\CMakeFiles\generate.stamp is up-to-date.
5>  RecastMesh.cpp
4>  compress.c
4>  crc32.c
4>  deflate.c
4>  example.c
2>  blocksort.c
6>  pcre_chartables.c
6>  pcre_compile.c
6>  pcre_config.c
2>  bzlib.c
6>  pcre_dfa_exec.c
2>  compress.c
4>  gzio.c
2>  crctable.c
2>  decompress.c
6>  pcre_exec.c
6>  pcre_fullinfo.c
2>  huffman.c
4>  infback.c
7>  DetourAlloc.cpp
4>  inffast.c
7>  DetourCommon.cpp
7>  DetourNavMesh.cpp
7>  DetourNavMeshBuilder.cpp
4>  inflate.c
4>  inftrees.c
6>  pcre_get.c
4>  trees.c
7>  DetourNavMeshQuery.cpp
6>  pcre_globals.c
6>  pcre_info.c
6>  pcre_maketables.c
4>  uncompr.c
5>  RecastMeshDetail.cpp
4>  zutil.c
5>  RecastRasterization.cpp
6>  pcre_newline.c
7>  DetourNode.cpp
7>  DetourObstacleAvoidance.cpp
2>  randtable.c
6>  pcre_ord2utf8.c
5>  RecastRegion.cpp
6>  pcre_refcount.c
6>  pcre_study.c
6>  pcre_tables.c
2>F:\arcemu-arcemu-5f9054b\arcemu-arcemu-5f9054b\dep\src\bzip2\bzlib.c(1423): warning C4996: 'setmode': The POSIX name for this item is deprecated. Instead, use the ISO C++ conformant name: _setmode. See online help for details.
2>          C:\Program Files (x86)\Microsoft Visual Studio 10.0\VC\include\io.h(314) : see declaration of 'setmode'
2>F:\arcemu-arcemu-5f9054b\arcemu-arcemu-5f9054b\dep\src\bzip2\bzlib.c(1423): warning C4996: 'fileno': The POSIX name for this item is deprecated. Instead, use the ISO C++ conformant name: _fileno. See online help for details.
2>          C:\Program Files (x86)\Microsoft Visual Studio 10.0\VC\include\stdio.h(723) : see declaration of 'fileno'
2>F:\arcemu-arcemu-5f9054b\arcemu-arcemu-5f9054b\dep\src\bzip2\bzlib.c(1431): warning C4996: 'fdopen': The POSIX name for this item is deprecated. Instead, use the ISO C++ conformant name: _fdopen. See online help for details.
2>          C:\Program Files (x86)\Microsoft Visual Studio 10.0\VC\include\stdio.h(721) : see declaration of 'fdopen'
6>  pcre_try_flipped.c
6>  pcre_ucp_searchfuncs.c
6>  pcre_valid_utf8.c
6>  pcre_version.c
6>  pcre_xclass.c
4>  zlib.vcxproj -> F:\build\zlib\Debug\zlib.lib
6>  pcre.vcxproj -> F:\build\pcre\Debug\pcre.lib
8>------ Rebuild All started: Project: shared, Configuration: Debug Win32 ------
8>  Building Custom Rule F:/arcemu-arcemu-5f9054b/arcemu-arcemu-5f9054b/cmake/shared/CMakeLists.txt
5>  recast.vcxproj -> F:\build\recast\Debug\recast.lib
9>------ Rebuild All started: Project: lualib, Configuration: Debug Win32 ------
8>  CMake does not need to re-run because F:\build\shared\CMakeFiles\generate.stamp is up-to-date.
2>  bzip2.vcxproj -> F:\build\tools\bzip2\Debug\bzip2.lib
7>  detour.vcxproj -> F:\build\detour\Debug\detour.lib
10>------ Rebuild All started: Project: libmpq_new, Configuration: Debug Win32 ------
9>  Building Custom Rule F:/arcemu-arcemu-5f9054b/arcemu-arcemu-5f9054b/cmake/scripts/lualib/CMakeLists.txt
9>  CMake does not need to re-run because F:\build\scripts\lualib\CMakeFiles\generate.stamp is up-to-date.
10>  Building Custom Rule F:/arcemu-arcemu-5f9054b/arcemu-arcemu-5f9054b/cmake/tools/libmpq_new/CMakeLists.txt
8>  CThreads.cpp
8>  CrashHandler.cpp
8>  Log.cpp
8>  MersenneTwister.cpp
8>f:\arcemu-arcemu-5f9054b\arcemu-arcemu-5f9054b\src\arcemu-shared\MersenneTwister.h : warning C4819: The file contains a character that cannot be represented in the current code page (936). Save the file in Unicode format to prevent data loss
8>  printStackTrace.cpp
8>  Util.cpp
10>  CMake does not need to re-run because F:\build\tools\libmpq_new\CMakeFiles\generate.stamp is up-to-date.
3>  Capsule.cpp
9>  lapi.c
3>  CollisionDetection.cpp
9>  lauxlib.c
9>  lbaselib.c
9>  lcode.c
9>  ldblib.c
9>  ldebug.c
9>  ldo.c
9>  ldump.c
9>  lfunc.c
9>  lgc.c
9>  linit.c
9>  liolib.c
9>  llex.c
9>  lmathlib.c
9>  lmem.c
10>  common.c
10>  explode.c
10>  extract.c
10>  huffman.c
10>  mpq.c
10>F:\arcemu-arcemu-5f9054b\arcemu-arcemu-5f9054b\dep\include\libmpq_new\explode.h(39): warning C4103: 'f:\arcemu-arcemu-5f9054b\arcemu-arcemu-5f9054b\dep\include\libmpq_new\explode.h' : alignment changed after including header, may be due to missing #pragma pack(pop)
10>F:\arcemu-arcemu-5f9054b\arcemu-arcemu-5f9054b\dep\include\libmpq_new\explode.h(69): warning C4103: 'f:\arcemu-arcemu-5f9054b\arcemu-arcemu-5f9054b\dep\include\libmpq_new\explode.h' : alignment changed after including header, may be due to missing #pragma pack(pop)
9>  loadlib.c
9>  lobject.c
10>F:\arcemu-arcemu-5f9054b\arcemu-arcemu-5f9054b\dep\include\libmpq_new\mpq-internal.h(69): warning C4103: 'f:\arcemu-arcemu-5f9054b\arcemu-arcemu-5f9054b\dep\include\libmpq_new\mpq-internal.h' : alignment changed after including header, may be due to missing #pragma pack(pop)
10>F:\arcemu-arcemu-5f9054b\arcemu-arcemu-5f9054b\dep\include\libmpq_new\mpq-internal.h(124): warning C4103: 'f:\arcemu-arcemu-5f9054b\arcemu-arcemu-5f9054b\dep\include\libmpq_new\mpq-internal.h' : alignment changed after including header, may be due to missing #pragma pack(pop)
10>  wave.c
10>F:\arcemu-arcemu-5f9054b\arcemu-arcemu-5f9054b\dep\include\libmpq_new\mpq-internal.h(69): warning C4103: 'f:\arcemu-arcemu-5f9054b\arcemu-arcemu-5f9054b\dep\include\libmpq_new\mpq-internal.h' : alignment changed after including header, may be due to missing #pragma pack(pop)
10>F:\arcemu-arcemu-5f9054b\arcemu-arcemu-5f9054b\dep\include\libmpq_new\mpq-internal.h(124): warning C4103: 'f:\arcemu-arcemu-5f9054b\arcemu-arcemu-5f9054b\dep\include\libmpq_new\mpq-internal.h' : alignment changed after including header, may be due to missing #pragma pack(pop)
10>F:\arcemu-arcemu-5f9054b\arcemu-arcemu-5f9054b\dep\src\libmpq_new\wave.c(86): warning C4018: '<' : signed/unsigned mismatch
10>F:\arcemu-arcemu-5f9054b\arcemu-arcemu-5f9054b\dep\src\libmpq_new\mpq.c(145): warning C4244: '=' : conversion from 'libmpq__off_t' to 'off_t', possible loss of data
9>  lopcodes.c
9>  loslib.c
10>F:\arcemu-arcemu-5f9054b\arcemu-arcemu-5f9054b\dep\src\libmpq_new\mpq.c(976): warning C4244: 'function' : conversion from 'libmpq__off_t' to 'uint32_t', possible loss of data
10>F:\arcemu-arcemu-5f9054b\arcemu-arcemu-5f9054b\dep\src\libmpq_new\mpq.c(993): warning C4244: 'function' : conversion from 'libmpq__off_t' to 'uint32_t', possible loss of data
10>F:\arcemu-arcemu-5f9054b\arcemu-arcemu-5f9054b\dep\src\libmpq_new\mpq.c(1007): warning C4244: 'function' : conversion from 'libmpq__off_t' to 'uint32_t', possible loss of data
9>  lparser.c
9>  lstate.c
9>  lstring.c
9>  lstrlib.c
9>  ltable.c
9>  ltablib.c
9>  ltm.c
9>  lua.c
9>  lundump.c
9>  lvm.c
9>  lzio.c
9>  print.c
10>  mpq_libmpq.cpp
3>  CoordinateFrame.cpp
10>F:\arcemu-arcemu-5f9054b\arcemu-arcemu-5f9054b\dep\include\libmpq_new\mpq_libmpq04.h(2): warning C4005: '_CRT_SECURE_NO_WARNINGS' : macro redefinition
10>          command-line arguments :  see previous definition of '_CRT_SECURE_NO_WARNINGS'
9>  lualib.vcxproj -> F:\build\scripts\lualib\Debug\lualib.lib
3>  Crypto.cpp
8>f:\arcemu-arcemu-5f9054b\arcemu-arcemu-5f9054b\src\arcemu-shared\MersenneTwister.h : warning C4819: The file contains a character that cannot be represented in the current code page (936). Save the file in Unicode format to prevent data loss
8>f:\arcemu-arcemu-5f9054b\arcemu-arcemu-5f9054b\src\arcemu-shared\MersenneTwister.h : warning C4819: The file contains a character that cannot be represented in the current code page (936). Save the file in Unicode format to prevent data loss
8>f:\arcemu-arcemu-5f9054b\arcemu-arcemu-5f9054b\src\arcemu-shared\MersenneTwister.h : warning C4819: The file contains a character that cannot be represented in the current code page (936). Save the file in Unicode format to prevent data loss
8>f:\arcemu-arcemu-5f9054b\arcemu-arcemu-5f9054b\src\arcemu-shared\MersenneTwister.h : warning C4819: The file contains a character that cannot be represented in the current code page (936). Save the file in Unicode format to prevent data loss
8>f:\arcemu-arcemu-5f9054b\arcemu-arcemu-5f9054b\src\arcemu-shared\MersenneTwister.h : warning C4819: The file contains a character that cannot be represented in the current code page (936). Save the file in Unicode format to prevent data loss
8>f:\arcemu-arcemu-5f9054b\arcemu-arcemu-5f9054b\src\arcemu-shared\MersenneTwister.h : warning C4819: The file contains a character that cannot be represented in the current code page (936). Save the file in Unicode format to prevent data loss
10>F:\arcemu-arcemu-5f9054b\arcemu-arcemu-5f9054b\dep\include\libmpq_new\mpq_libmpq04.h(32): warning C4244: 'initializing' : conversion from 'libmpq__off_t' to 'unsigned int', possible loss of data
10>F:\arcemu-arcemu-5f9054b\arcemu-arcemu-5f9054b\dep\include\libmpq_new\mpq_libmpq04.h(70): warning C4244: 'return' : conversion from 'libmpq__off_t' to 'size_t', possible loss of data
10>F:\arcemu-arcemu-5f9054b\arcemu-arcemu-5f9054b\dep\include\libmpq_new\mpq_libmpq04.h(71): warning C4244: 'return' : conversion from 'libmpq__off_t' to 'size_t', possible loss of data
10>F:\arcemu-arcemu-5f9054b\arcemu-arcemu-5f9054b\dep\src\libmpq_new\mpq_libmpq.cpp(65): warning C4244: 'initializing' : conversion from 'libmpq__off_t' to 'unsigned int', possible loss of data
10>F:\arcemu-arcemu-5f9054b\arcemu-arcemu-5f9054b\dep\src\libmpq_new\mpq_libmpq.cpp(81): warning C4244: 'initializing' : conversion from 'libmpq__off_t' to 'size_t', possible loss of data
10>F:\arcemu-arcemu-5f9054b\arcemu-arcemu-5f9054b\dep\src\libmpq_new\mpq_libmpq.cpp(83): warning C4244: '=' : conversion from 'libmpq__off_t' to 'size_t', possible loss of data
3>  Cylinder.cpp
8>  crc32.cpp
8>  MapFile.cpp
8>  MapFileEntry.cpp
8>  TextFile.cpp
8>  FindFiles.cpp
8>  DynLib.cpp
3>  debugAssert.cpp
8>  SysInfo.cpp
8>  PerformanceCounter.cpp
3>  fileutils.cpp
8>  Mutex.cpp
8>  ThreadPool.cpp
3>  format.cpp
3>  g3dfnmatch.cpp
3>  g3dmath.cpp
3>  Line.cpp
8>  AtomicULong.cpp
10>  libmpq_new.vcxproj -> F:\build\tools\libmpq_new\Debug\libmpq_new.lib
11>------ Rebuild All started: Project: dbcfile, Configuration: Debug Win32 ------
12>------ Rebuild All started: Project: loadlib, Configuration: Debug Win32 ------
3>  LineSegment.cpp
8>  AtomicFloat.cpp
8>f:\arcemu-arcemu-5f9054b\arcemu-arcemu-5f9054b\src\arcemu-shared\MersenneTwister.h : warning C4819: The file contains a character that cannot be represented in the current code page (936). Save the file in Unicode format to prevent data loss
11>  Building Custom Rule F:/arcemu-arcemu-5f9054b/arcemu-arcemu-5f9054b/cmake/tools/dbcfile/CMakeLists.txt
12>  Building Custom Rule F:/arcemu-arcemu-5f9054b/arcemu-arcemu-5f9054b/cmake/tools/loadlib/CMakeLists.txt
11>  CMake does not need to re-run because F:\build\tools\dbcfile\CMakeFiles\generate.stamp is up-to-date.
12>  CMake does not need to re-run because F:\build\tools\loadlib\CMakeFiles\generate.stamp is up-to-date.
8>  AtomicCounter.cpp
3>  Log.cpp
8>f:\arcemu-arcemu-5f9054b\arcemu-arcemu-5f9054b\src\arcemu-shared\MersenneTwister.h : warning C4819: The file contains a character that cannot be represented in the current code page (936). Save the file in Unicode format to prevent data loss
3>  Matrix.cpp
8>f:\arcemu-arcemu-5f9054b\arcemu-arcemu-5f9054b\src\arcemu-shared\MersenneTwister.h : warning C4819: The file contains a character that cannot be represented in the current code page (936). Save the file in Unicode format to prevent data loss
8>  AtomicBoolean.cpp
11>  dbcfile.cpp
12>  adt.cpp
12>  loadlib.cpp
12>  wdt.cpp
12>F:\arcemu-arcemu-5f9054b\arcemu-arcemu-5f9054b\dep\include\libmpq_new\mpq_libmpq04.h(2): warning C4005: '_CRT_SECURE_NO_WARNINGS' : macro redefinition
12>          command-line arguments :  see previous definition of '_CRT_SECURE_NO_WARNINGS'
8>  ConditionVariable.cpp
8>  arcemu_getopt.cpp
3>  Matrix3.cpp
3>  Matrix4.cpp
8>f:\arcemu-arcemu-5f9054b\arcemu-arcemu-5f9054b\src\arcemu-shared\MersenneTwister.h : warning C4819: The file contains a character that cannot be represented in the current code page (936). Save the file in Unicode format to prevent data loss
8>  BigNumber.cpp
12>F:\arcemu-arcemu-5f9054b\arcemu-arcemu-5f9054b\dep\include\libmpq_new\mpq_libmpq04.h(32): warning C4244: 'initializing' : conversion from 'libmpq__off_t' to 'unsigned int', possible loss of data
12>F:\arcemu-arcemu-5f9054b\arcemu-arcemu-5f9054b\dep\include\libmpq_new\mpq_libmpq04.h(70): warning C4244: 'return' : conversion from 'libmpq__off_t' to 'size_t', possible loss of data
12>F:\arcemu-arcemu-5f9054b\arcemu-arcemu-5f9054b\dep\include\libmpq_new\mpq_libmpq04.h(71): warning C4244: 'return' : conversion from 'libmpq__off_t' to 'size_t', possible loss of data
11>F:\arcemu-arcemu-5f9054b\arcemu-arcemu-5f9054b\dep\include\libmpq_new\mpq_libmpq04.h(2): warning C4005: '_CRT_SECURE_NO_WARNINGS' : macro redefinition
8>f:\arcemu-arcemu-5f9054b\arcemu-arcemu-5f9054b\src\arcemu-shared\MersenneTwister.h : warning C4819: The file contains a character that cannot be represented in the current code page (936). Save the file in Unicode format to prevent data loss
8>f:\arcemu-arcemu-5f9054b\arcemu-arcemu-5f9054b\src\arcemu-shared\MersenneTwister.h : warning C4819: The file contains a character that cannot be represented in the current code page (936). Save the file in Unicode format to prevent data loss
11>          command-line arguments :  see previous definition of '_CRT_SECURE_NO_WARNINGS'
3>  MemoryManager.cpp
3>  Plane.cpp
11>F:\arcemu-arcemu-5f9054b\arcemu-arcemu-5f9054b\dep\include\libmpq_new\mpq_libmpq04.h(32): warning C4244: 'initializing' : conversion from 'libmpq__off_t' to 'unsigned int', possible loss of data
11>F:\arcemu-arcemu-5f9054b\arcemu-arcemu-5f9054b\dep\include\libmpq_new\mpq_libmpq04.h(70): warning C4244: 'return' : conversion from 'libmpq__off_t' to 'size_t', possible loss of data
11>F:\arcemu-arcemu-5f9054b\arcemu-arcemu-5f9054b\dep\include\libmpq_new\mpq_libmpq04.h(71): warning C4244: 'return' : conversion from 'libmpq__off_t' to 'size_t', possible loss of data
8>  MD5.cpp
3>  prompt.cpp
12>  loadlib.vcxproj -> F:\build\tools\loadlib\Debug\loadlib.lib
8>  Sha1.cpp
13>------ Rebuild All started: Project: vmap_extractor, Configuration: Debug Win32 ------
8>f:\arcemu-arcemu-5f9054b\arcemu-arcemu-5f9054b\src\arcemu-shared\MersenneTwister.h : warning C4819: The file contains a character that cannot be represented in the current code page (936). Save the file in Unicode format to prevent data loss
13>  Building Custom Rule F:/arcemu-arcemu-5f9054b/arcemu-arcemu-5f9054b/cmake/tools/vmap_tools/vmap_extractor/CMakeLists.txt
8>f:\arcemu-arcemu-5f9054b\arcemu-arcemu-5f9054b\src\arcemu-shared\MersenneTwister.h : warning C4819: The file contains a character that cannot be represented in the current code page (936). Save the file in Unicode format to prevent data loss
13>  CMake does not need to re-run because F:\build\tools\vmap_tools\vmap_extractor\CMakeFiles\generate.stamp is up-to-date.
3>  Quat.cpp
13>  adtfile.cpp
13>  dbcfile.cpp
13>  model.cpp
13>  vmapexport.cpp
8>  WowCrypt.cpp
13>F:\arcemu-arcemu-5f9054b\arcemu-arcemu-5f9054b\dep\include\libmpq_new\mpq_libmpq04.h(2): warning C4005: '_CRT_SECURE_NO_WARNINGS' : macro redefinition
13>          command-line arguments :  see previous definition of '_CRT_SECURE_NO_WARNINGS'
13>  wdtfile.cpp
13>  wmo.cpp
13>F:\arcemu-arcemu-5f9054b\arcemu-arcemu-5f9054b\dep\include\libmpq_new\mpq_libmpq04.h(2): warning C4005: '_CRT_SECURE_NO_WARNINGS' : macro redefinition
11>  dbcfile.vcxproj -> F:\build\tools\dbcfile\Debug\dbcfile.lib
13>          command-line arguments :  see previous definition of '_CRT_SECURE_NO_WARNINGS'
8>  Config.cpp
14>------ Rebuild All started: Project: creature_data, Configuration: Debug Win32 ------
15>------ Rebuild All started: Project: ad, Configuration: Debug Win32 ------
8>f:\arcemu-arcemu-5f9054b\arcemu-arcemu-5f9054b\src\arcemu-shared\MersenneTwister.h : warning C4819: The file contains a character that cannot be represented in the current code page (936). Save the file in Unicode format to prevent data loss
8>  Database.cpp
14>  Building Custom Rule F:/arcemu-arcemu-5f9054b/arcemu-arcemu-5f9054b/cmake/tools/creature_data/CMakeLists.txt
15>  Building Custom Rule F:/arcemu-arcemu-5f9054b/arcemu-arcemu-5f9054b/cmake/tools/ad/CMakeLists.txt
15>  CMake does not need to re-run because F:\build\tools\ad\CMakeFiles\generate.stamp is up-to-date.
14>  CMake does not need to re-run because F:\build\tools\creature_data\CMakeFiles\generate.stamp is up-to-date.
8>f:\arcemu-arcemu-5f9054b\arcemu-arcemu-5f9054b\src\arcemu-shared\MersenneTwister.h : warning C4819: The file contains a character that cannot be represented in the current code page (936). Save the file in Unicode format to prevent data loss
14>  Main.cpp
15>  System.cpp
13>F:\arcemu-arcemu-5f9054b\arcemu-arcemu-5f9054b\dep\include\libmpq_new\mpq_libmpq04.h(2): warning C4005: '_CRT_SECURE_NO_WARNINGS' : macro redefinition
13>          command-line arguments :  see previous definition of '_CRT_SECURE_NO_WARNINGS'
3>  Random.cpp
3>  Ray.cpp
13>F:\arcemu-arcemu-5f9054b\arcemu-arcemu-5f9054b\dep\include\libmpq_new\mpq_libmpq04.h(32): warning C4244: 'initializing' : conversion from 'libmpq__off_t' to 'unsigned int', possible loss of data
13>F:\arcemu-arcemu-5f9054b\arcemu-arcemu-5f9054b\dep\include\libmpq_new\mpq_libmpq04.h(70): warning C4244: 'return' : conversion from 'libmpq__off_t' to 'size_t', possible loss of data
13>F:\arcemu-arcemu-5f9054b\arcemu-arcemu-5f9054b\dep\include\libmpq_new\mpq_libmpq04.h(71): warning C4244: 'return' : conversion from 'libmpq__off_t' to 'size_t', possible loss of data
13>F:\arcemu-arcemu-5f9054b\arcemu-arcemu-5f9054b\dep\include\libmpq_new\mpq_libmpq04.h(32): warning C4244: 'initializing' : conversion from 'libmpq__off_t' to 'unsigned int', possible loss of data
3>  ReferenceCount.cpp
13>F:\arcemu-arcemu-5f9054b\arcemu-arcemu-5f9054b\dep\include\libmpq_new\mpq_libmpq04.h(70): warning C4244: 'return' : conversion from 'libmpq__off_t' to 'size_t', possible loss of data
13>F:\arcemu-arcemu-5f9054b\arcemu-arcemu-5f9054b\dep\include\libmpq_new\mpq_libmpq04.h(71): warning C4244: 'return' : conversion from 'libmpq__off_t' to 'size_t', possible loss of data
8>f:\arcemu-arcemu-5f9054b\arcemu-arcemu-5f9054b\src\arcemu-shared\MersenneTwister.h : warning C4819: The file contains a character that cannot be represented in the current code page (936). Save the file in Unicode format to prevent data loss
3>  RegistryUtil.cpp
8>  MySQLDatabase.cpp
13>F:\arcemu-arcemu-5f9054b\arcemu-arcemu-5f9054b\dep\include\libmpq_new\mpq_libmpq04.h(2): warning C4005: '_CRT_SECURE_NO_WARNINGS' : macro redefinition
13>          command-line arguments :  see previous definition of '_CRT_SECURE_NO_WARNINGS'
13>F:\arcemu-arcemu-5f9054b\arcemu-arcemu-5f9054b\dep\include\libmpq_new\mpq_libmpq04.h(32): warning C4244: 'initializing' : conversion from 'libmpq__off_t' to 'unsigned int', possible loss of data
13>F:\arcemu-arcemu-5f9054b\arcemu-arcemu-5f9054b\dep\include\libmpq_new\mpq_libmpq04.h(32): warning C4244: 'initializing' : conversion from 'libmpq__off_t' to 'unsigned int', possible loss of data
13>F:\arcemu-arcemu-5f9054b\arcemu-arcemu-5f9054b\dep\include\libmpq_new\mpq_libmpq04.h(70): warning C4244: 'return' : conversion from 'libmpq__off_t' to 'size_t', possible loss of data
13>F:\arcemu-arcemu-5f9054b\arcemu-arcemu-5f9054b\dep\include\libmpq_new\mpq_libmpq04.h(71): warning C4244: 'return' : conversion from 'libmpq__off_t' to 'size_t', possible loss of data
13>F:\arcemu-arcemu-5f9054b\arcemu-arcemu-5f9054b\dep\include\libmpq_new\mpq_libmpq04.h(2): warning C4005: '_CRT_SECURE_NO_WARNINGS' : macro redefinition
13>          command-line arguments :  see previous definition of '_CRT_SECURE_NO_WARNINGS'
13>F:\arcemu-arcemu-5f9054b\arcemu-arcemu-5f9054b\dep\include\libmpq_new\mpq_libmpq04.h(70): warning C4244: 'return' : conversion from 'libmpq__off_t' to 'size_t', possible loss of data
13>F:\arcemu-arcemu-5f9054b\arcemu-arcemu-5f9054b\dep\include\libmpq_new\mpq_libmpq04.h(71): warning C4244: 'return' : conversion from 'libmpq__off_t' to 'size_t', possible loss of data
13>F:\arcemu-arcemu-5f9054b\arcemu-arcemu-5f9054b\dep\include\libmpq_new\mpq_libmpq04.h(2): warning C4005: '_CRT_SECURE_NO_WARNINGS' : macro redefinition
13>          command-line arguments :  see previous definition of '_CRT_SECURE_NO_WARNINGS'
13>F:\arcemu-arcemu-5f9054b\arcemu-arcemu-5f9054b\dep\include\libmpq_new\mpq_libmpq04.h(32): warning C4244: 'initializing' : conversion from 'libmpq__off_t' to 'unsigned int', possible loss of data
13>F:\arcemu-arcemu-5f9054b\arcemu-arcemu-5f9054b\dep\include\libmpq_new\mpq_libmpq04.h(32): warning C4244: 'initializing' : conversion from 'libmpq__off_t' to 'unsigned int', possible loss of data
13>F:\arcemu-arcemu-5f9054b\arcemu-arcemu-5f9054b\dep\include\libmpq_new\mpq_libmpq04.h(70): warning C4244: 'return' : conversion from 'libmpq__off_t' to 'size_t', possible loss of data
13>F:\arcemu-arcemu-5f9054b\arcemu-arcemu-5f9054b\dep\include\libmpq_new\mpq_libmpq04.h(71): warning C4244: 'return' : conversion from 'libmpq__off_t' to 'size_t', possible loss of data
13>F:\arcemu-arcemu-5f9054b\arcemu-arcemu-5f9054b\dep\include\libmpq_new\mpq_libmpq04.h(70): warning C4244: 'return' : conversion from 'libmpq__off_t' to 'size_t', possible loss of data
13>F:\arcemu-arcemu-5f9054b\arcemu-arcemu-5f9054b\dep\include\libmpq_new\mpq_libmpq04.h(71): warning C4244: 'return' : conversion from 'libmpq__off_t' to 'size_t', possible loss of data
8>f:\arcemu-arcemu-5f9054b\arcemu-arcemu-5f9054b\src\arcemu-shared\MersenneTwister.h : warning C4819: The file contains a character that cannot be represented in the current code page (936). Save the file in Unicode format to prevent data loss
13>F:\arcemu-arcemu-5f9054b\arcemu-arcemu-5f9054b\src\tools\vmap_tools\vmap_extractor\vmapexport.cpp(485): warning C4800: 'int' : forcing value to bool 'true' or 'false' (performance warning)
8>f:\arcemu-arcemu-5f9054b\arcemu-arcemu-5f9054b\src\arcemu-shared\MersenneTwister.h : warning C4819: The file contains a character that cannot be represented in the current code page (936). Save the file in Unicode format to prevent data loss
8>  CreateInterface.cpp
3>  Sphere.cpp
3>  stringutils.cpp
14>F:\arcemu-arcemu-5f9054b\arcemu-arcemu-5f9054b\dep\include\libmpq_new\mpq_libmpq04.h(2): warning C4005: '_CRT_SECURE_NO_WARNINGS' : macro redefinition
14>          command-line arguments :  see previous definition of '_CRT_SECURE_NO_WARNINGS'
14>F:\arcemu-arcemu-5f9054b\arcemu-arcemu-5f9054b\dep\include\libmpq_new\mpq_libmpq04.h(32): warning C4244: 'initializing' : conversion from 'libmpq__off_t' to 'unsigned int', possible loss of data
14>F:\arcemu-arcemu-5f9054b\arcemu-arcemu-5f9054b\dep\include\libmpq_new\mpq_libmpq04.h(70): warning C4244: 'return' : conversion from 'libmpq__off_t' to 'size_t', possible loss of data
14>F:\arcemu-arcemu-5f9054b\arcemu-arcemu-5f9054b\dep\include\libmpq_new\mpq_libmpq04.h(71): warning C4244: 'return' : conversion from 'libmpq__off_t' to 'size_t', possible loss of data
8>f:\arcemu-arcemu-5f9054b\arcemu-arcemu-5f9054b\src\arcemu-shared\MersenneTwister.h : warning C4819: The file contains a character that cannot be represented in the current code page (936). Save the file in Unicode format to prevent data loss
15>F:\arcemu-arcemu-5f9054b\arcemu-arcemu-5f9054b\dep\include\libmpq_new\mpq_libmpq04.h(2): warning C4005: '_CRT_SECURE_NO_WARNINGS' : macro redefinition
15>          command-line arguments :  see previous definition of '_CRT_SECURE_NO_WARNINGS'
8>  CircularBuffer.cpp
15>F:\arcemu-arcemu-5f9054b\arcemu-arcemu-5f9054b\dep\include\libmpq_new\mpq_libmpq04.h(32): warning C4244: 'initializing' : conversion from 'libmpq__off_t' to 'unsigned int', possible loss of data
15>F:\arcemu-arcemu-5f9054b\arcemu-arcemu-5f9054b\dep\include\libmpq_new\mpq_libmpq04.h(70): warning C4244: 'return' : conversion from 'libmpq__off_t' to 'size_t', possible loss of data
15>F:\arcemu-arcemu-5f9054b\arcemu-arcemu-5f9054b\dep\include\libmpq_new\mpq_libmpq04.h(71): warning C4244: 'return' : conversion from 'libmpq__off_t' to 'size_t', possible loss of data
3>  System.cpp
8>  Socket.cpp
3>  TextInput.cpp
8>f:\arcemu-arcemu-5f9054b\arcemu-arcemu-5f9054b\src\arcemu-shared\MersenneTwister.h : warning C4819: The file contains a character that cannot be represented in the current code page (936). Save the file in Unicode format to prevent data loss
8>  SocketMgrWin32.cpp
3>  TextOutput.cpp
8>  SocketOpsWin32.cpp
3>  Triangle.cpp
8>f:\arcemu-arcemu-5f9054b\arcemu-arcemu-5f9054b\src\arcemu-shared\MersenneTwister.h : warning C4819: The file contains a character that cannot be represented in the current code page (936). Save the file in Unicode format to prevent data loss
8>f:\arcemu-arcemu-5f9054b\arcemu-arcemu-5f9054b\src\arcemu-shared\MersenneTwister.h : warning C4819: The file contains a character that cannot be represented in the current code page (936). Save the file in Unicode format to prevent data loss
8>  SocketWin32.cpp
3>  Port System::memcpy SIMD to all platforms
3>  Port System::memfill SIMD to all platforms
8>f:\arcemu-arcemu-5f9054b\arcemu-arcemu-5f9054b\src\arcemu-shared\MersenneTwister.h : warning C4819: The file contains a character that cannot be represented in the current code page (936). Save the file in Unicode format to prevent data loss
3>  UprightFrame.cpp
3>  Vector2.cpp
8>f:\arcemu-arcemu-5f9054b\arcemu-arcemu-5f9054b\src\arcemu-shared\MersenneTwister.h : warning C4819: The file contains a character that cannot be represented in the current code page (936). Save the file in Unicode format to prevent data loss
8>  StackWalker.cpp
13>  vmap_extractor.vcxproj -> F:\build\tools\vmap_tools\vmap_extractor\Debug\vmap_extractor.exe
8>f:\arcemu-arcemu-5f9054b\arcemu-arcemu-5f9054b\src\arcemu-shared\MersenneTwister.h : warning C4819: The file contains a character that cannot be represented in the current code page (936). Save the file in Unicode format to prevent data loss
3>  Vector3.cpp
3>  Vector4.cpp
8>  StackTrace.cpp
14>  creature_data.vcxproj -> F:\build\tools\creature_data\Debug\creature_data.exe
8>f:\arcemu-arcemu-5f9054b\arcemu-arcemu-5f9054b\src\arcemu-shared\MersenneTwister.h : warning C4819: The file contains a character that cannot be represented in the current code page (936). Save the file in Unicode format to prevent data loss
15>  ad.vcxproj -> F:\build\tools\ad\Debug\ad.exe
8>  shared.vcxproj -> F:\build\shared\Debug\shared.lib
16>------ Rebuild All started: Project: logon, Configuration: Debug Win32 ------
16>  Building Custom Rule F:/arcemu-arcemu-5f9054b/arcemu-arcemu-5f9054b/cmake/logon/CMakeLists.txt
16>  CMake does not need to re-run because F:\build\logon\CMakeFiles\generate.stamp is up-to-date.
3>  g3dlite.vcxproj -> F:\build\g3dlite\Debug\g3dlite.lib
16>  LogonStdAfx.cpp
17>------ Rebuild All started: Project: vmaplib, Configuration: Debug Win32 ------
17>  Building Custom Rule F:/arcemu-arcemu-5f9054b/arcemu-arcemu-5f9054b/cmake/vmaplib/CMakeLists.txt
17>  CMake does not need to re-run because F:\build\vmaplib\CMakeFiles\generate.stamp is up-to-date.
17>  BIH.cpp
17>  MapTree.cpp
17>  ModelInstance.cpp
17>  TileAssembler.cpp
17>  VMapFactory.cpp
17>  VMapManager2.cpp
16>f:\arcemu-arcemu-5f9054b\arcemu-arcemu-5f9054b\src\arcemu-shared\MersenneTwister.h : warning C4819: The file contains a character that cannot be represented in the current code page (936). Save the file in Unicode format to prevent data loss
17>  WorldModel.cpp
16>  AccountCache.cpp
16>  AuthSocket.cpp
16>  AutoPatcher.cpp
16>  LogonCommServer.cpp
16>  LogonConsole.cpp
16>  LogonOpcodes.cpp
16>  Main.cpp
17>  vmaplib.vcxproj -> F:\build\vmaplib\Debug\vmaplib.lib
18>------ Rebuild All started: Project: world, Configuration: Debug Win32 ------
19>------ Rebuild All started: Project: vmap_assembler, Configuration: Debug Win32 ------
16>     Creating library F:/build/logon/Debug/logon.lib and object F:/build/logon/Debug/logon.exp
19>  Building Custom Rule F:/arcemu-arcemu-5f9054b/arcemu-arcemu-5f9054b/cmake/tools/vmap_tools/vmap_assembler/CMakeLists.txt
19>  CMake does not need to re-run because F:\build\tools\vmap_tools\vmap_assembler\CMakeFiles\generate.stamp is up-to-date.
19>  vmap_assembler.cpp
16>     Creating library F:/build/logon/Debug/logon.lib and object F:/build/logon/Debug/logon.exp
16>  logon.vcxproj -> F:\build\logon\Debug\logon.exe
19>  vmap_assembler.vcxproj -> F:\build\tools\vmap_tools\vmap_assembler\Debug\vmap_assembler.exe
18>  Building Custom Rule F:/arcemu-arcemu-5f9054b/arcemu-arcemu-5f9054b/cmake/world/CMakeLists.txt
18>  CMake does not need to re-run because F:\build\world\CMakeFiles\generate.stamp is up-to-date.
18>  StdAfx.cpp
18>f:\arcemu-arcemu-5f9054b\arcemu-arcemu-5f9054b\src\arcemu-shared\MersenneTwister.h : warning C4819: The file contains a character that cannot be represented in the current code page (936). Save the file in Unicode format to prevent data loss
18>f:\arcemu-arcemu-5f9054b\arcemu-arcemu-5f9054b\src\arcemu-world\../arcemu-shared/MersenneTwister.h : warning C4819: The file contains a character that cannot be represented in the current code page (936). Save the file in Unicode format to prevent data loss
18>  DBCStores.cpp
18>  AchievementMgr.cpp
18>  CollideInterface.cpp
18>  VoiceChatHandler.cpp
18>  DayWatcherThread.cpp
18>  CommonScheduleThread.cpp
18>  ArenaTeam.cpp
18>  DatabaseCleaner.cpp
18>  ObjectStorage.cpp
18>  AddonMgr.cpp
18>  AIInterface.cpp
18>  AIEvents.cpp
18>  AreaTrigger.cpp
18>  Arenas.cpp
18>  AuctionHouse.cpp
18>  AuctionMgr.cpp
18>  Battleground.cpp
18>  BattlegroundCommands.cpp
18>  BattlegroundHandler.cpp
18>  BattlegroundMgr.cpp
18>  Channel.cpp
18>  ChannelHandler.cpp
18>  CharacterHandler.cpp
18>  Chat.cpp
18>  ChatHandler.cpp
18>  CombatHandler.cpp
18>  Container.cpp
18>  Corpse.cpp
18>  Creature.cpp
18>  Summon.cpp
18>  CompanionSummon.cpp
18>  GuardianSummon.cpp
18>  PossessedSummon.cpp
18>  TotemSummon.cpp
18>  WildSummon.cpp
18>  debugcmds.cpp
18>  DuelHandler.cpp
18>  DynamicObject.cpp
18>  EquipmentSetMgr.cpp
18>  EventableObject.cpp
18>  EventMgr.cpp
18>  faction.cpp
18>  GameObject.cpp
18>  GMTicket.cpp
18>  GMTicketCommands.cpp
18>  Gossip.cpp
18>  Group.cpp
18>  GroupHandler.cpp
18>  Guild.cpp
18>  GuildHandler.cpp
18>  HonorHandler.cpp
18>  InstanceCommands.cpp
18>  Item.cpp
18>  ItemHandler.cpp
18>  ItemInterface.cpp
18>  Level0.cpp
18>  Level1.cpp
18>  Level2.cpp
18>  Level3.cpp
18>  LfgHandler.cpp
18>  LfgMgr.cpp
18>  LootMgr.cpp
18>  LocalizationMgr.cpp
18>  LogonCommClient.cpp
18>  LogonCommHandler.cpp
18>  MailSystem.cpp
18>  MapCell.cpp
18>  Map.cpp
18>  MapScriptInterface.cpp
18>  MapMgr.cpp
18>  MapMgrEventHandlers.cpp
18>F:\arcemu-arcemu-5f9054b\arcemu-arcemu-5f9054b\src\arcemu-world\MapMgr.cpp(42): warning C4355: 'this' : used in base member initializer list
18>  MiscHandler.cpp
18>  MovementHandler.cpp
18>  NPCHandler.cpp
18>  Object.cpp
18>  ObjectMgr.cpp
18>  Opcodes.cpp
18>  Pet.cpp
18>  PetHandler.cpp
18>  Player.cpp
18>F:\arcemu-arcemu-5f9054b\arcemu-arcemu-5f9054b\src\arcemu-world\Player.cpp(201): warning C4355: 'this' : used in base member initializer list
18>  PlayerPacketWrapper.cpp
18>  QueryHandler.cpp
18>  Quest.cpp
18>  QuestHandler.cpp
18>  QuestMgr.cpp
18>  QuestCommands.cpp
18>  RaidHandler.cpp
18>  RecallCommands.cpp
18>  ReputationHandler.cpp
18>  ScriptMgr.cpp
18>  SocialHandler.cpp
18>  SpeedDetector.cpp
18>  SpellAuras.cpp
18>  SpellTarget.cpp
18>  Spell.cpp
18>  SummonHandler.cpp
18>  SpellEffects.cpp
18>  SpellHandler.cpp
18>  HackFixes.cpp
18>  Stats.cpp
18>  TaxiHandler.cpp
18>  TaxiMgr.cpp
18>  TerrainMgr.cpp
18>  TradeHandler.cpp
18>  TransporterHandler.cpp
18>  Unit.cpp
18>  Vehicle.cpp
18>  VehicleHandler.cpp
18>  WayPoints.cpp
18>  WeatherMgr.cpp
18>  World.cpp
18>  WorldCreator.cpp
18>  WorldSession.cpp
18>  WorldSocket.cpp
18>  WorldStatesHandler.cpp
18>  WorldRunnable.cpp
18>  WordFilter.cpp
18>  Main.cpp
18>  Master.cpp
18>  CConsole.cpp
18>  ConsoleCommands.cpp
18>  ConsoleListener.cpp
18>  WUtil.cpp
18>  SpellProc.cpp
18>  SpellProc_DeathKnight.cpp
18>  SpellProc_Druid.cpp
18>  SpellProc_Hunter.cpp
18>  SpellProc_Items.cpp
18>  SpellProc_Mage.cpp
18>  SpellProc_Paladin.cpp
18>  SpellProc_Priest.cpp
18>  SpellProc_Rogue.cpp
18>  SpellProc_Shaman.cpp
18>  SpellProc_Warlock.cpp
18>  SpellProc_Warrior.cpp
18>  SpellMgr.cpp
18>  Spell_DeathKnight.cpp
18>  Spell_Druid.cpp
18>  Spell_Hunter.cpp
18>  Spell_Mage.cpp
18>  Spell_Paladin.cpp
18>  Spell_Priest.cpp
18>  Spell_Rogue.cpp
18>  Spell_Shaman.cpp
18>  Spell_Warlock.cpp
18>  Spell_Warrior.cpp
18>  DeathKnight.cpp
18>  Druid.cpp
18>  Hunter.cpp
18>  Mage.cpp
18>  Paladin.cpp
18>  Priest.cpp
18>  Rogue.cpp
18>  Shaman.cpp
18>  Warlock.cpp
18>  Warrior.cpp
18>     Creating library F:/build/world/Debug/world.lib and object F:/build/world/Debug/world.exp
18>     Creating library F:/build/world/Debug/world.lib and object F:/build/world/Debug/world.exp
18>  world.vcxproj -> F:\build\world\Debug\world.exe
20>------ Rebuild All started: Project: SpellHandlers, Configuration: Debug Win32 ------
21>------ Rebuild All started: Project: ServerStatusPlugin, Configuration: Debug Win32 ------
22>------ Rebuild All started: Project: QuestScripts, Configuration: Debug Win32 ------
23>------ Rebuild All started: Project: MiscScripts, Configuration: Debug Win32 ------
24>------ Rebuild All started: Project: LuaEngine, Configuration: Debug Win32 ------
25>------ Rebuild All started: Project: InstanceScripts, Configuration: Debug Win32 ------
23>  Building Custom Rule F:/arcemu-arcemu-5f9054b/arcemu-arcemu-5f9054b/cmake/scripts/miscscripts/CMakeLists.txt
25>  Building Custom Rule F:/arcemu-arcemu-5f9054b/arcemu-arcemu-5f9054b/cmake/scripts/instancescripts/CMakeLists.txt
22>  Building Custom Rule F:/arcemu-arcemu-5f9054b/arcemu-arcemu-5f9054b/cmake/scripts/questscripts/CMakeLists.txt
20>  Building Custom Rule F:/arcemu-arcemu-5f9054b/arcemu-arcemu-5f9054b/cmake/spellhandlers/CMakeLists.txt
21>  Building Custom Rule F:/arcemu-arcemu-5f9054b/arcemu-arcemu-5f9054b/cmake/scripts/serverstatusplugin/CMakeLists.txt
23>  CMake does not need to re-run because F:\build\scripts\miscscripts\CMakeFiles\generate.stamp is up-to-date.
25>  CMake does not need to re-run because F:\build\scripts\instancescripts\CMakeFiles\generate.stamp is up-to-date.
20>  CMake does not need to re-run because F:\build\spellhandlers\CMakeFiles\generate.stamp is up-to-date.
22>  CMake does not need to re-run because F:\build\scripts\questscripts\CMakeFiles\generate.stamp is up-to-date.
21>  CMake does not need to re-run because F:\build\scripts\serverstatusplugin\CMakeFiles\generate.stamp is up-to-date.
24>  Building Custom Rule F:/arcemu-arcemu-5f9054b/arcemu-arcemu-5f9054b/cmake/scripts/luaengine/CMakeLists.txt
25>  Setup.cpp
23>  Setup.cpp
20>  Setup.cpp
24>  CMake does not need to re-run because F:\build\scripts\luaengine\CMakeFiles\generate.stamp is up-to-date.
21>  ServerStatusPlugin.cpp
22>  Setup.cpp
24>  LUAEngine.cpp
25>f:\arcemu-arcemu-5f9054b\arcemu-arcemu-5f9054b\src\arcemu-shared\MersenneTwister.h : warning C4819: The file contains a character that cannot be represented in the current code page (936). Save the file in Unicode format to prevent data loss
21>f:\arcemu-arcemu-5f9054b\arcemu-arcemu-5f9054b\src\arcemu-shared\MersenneTwister.h : warning C4819: The file contains a character that cannot be represented in the current code page (936). Save the file in Unicode format to prevent data loss
20>f:\arcemu-arcemu-5f9054b\arcemu-arcemu-5f9054b\src\arcemu-shared\MersenneTwister.h : warning C4819: The file contains a character that cannot be represented in the current code page (936). Save the file in Unicode format to prevent data loss
25>f:\arcemu-arcemu-5f9054b\arcemu-arcemu-5f9054b\src\arcemu-world\../arcemu-shared/MersenneTwister.h : warning C4819: The file contains a character that cannot be represented in the current code page (936). Save the file in Unicode format to prevent data loss
21>f:\arcemu-arcemu-5f9054b\arcemu-arcemu-5f9054b\src\arcemu-world\../arcemu-shared/MersenneTwister.h : warning C4819: The file contains a character that cannot be represented in the current code page (936). Save the file in Unicode format to prevent data loss
23>f:\arcemu-arcemu-5f9054b\arcemu-arcemu-5f9054b\src\arcemu-shared\MersenneTwister.h : warning C4819: The file contains a character that cannot be represented in the current code page (936). Save the file in Unicode format to prevent data loss
20>f:\arcemu-arcemu-5f9054b\arcemu-arcemu-5f9054b\src\arcemu-world\../arcemu-shared/MersenneTwister.h : warning C4819: The file contains a character that cannot be represented in the current code page (936). Save the file in Unicode format to prevent data loss
23>f:\arcemu-arcemu-5f9054b\arcemu-arcemu-5f9054b\src\arcemu-world\../arcemu-shared/MersenneTwister.h : warning C4819: The file contains a character that cannot be represented in the current code page (936). Save the file in Unicode format to prevent data loss
22>f:\arcemu-arcemu-5f9054b\arcemu-arcemu-5f9054b\src\arcemu-shared\MersenneTwister.h : warning C4819: The file contains a character that cannot be represented in the current code page (936). Save the file in Unicode format to prevent data loss
22>f:\arcemu-arcemu-5f9054b\arcemu-arcemu-5f9054b\src\arcemu-world\../arcemu-shared/MersenneTwister.h : warning C4819: The file contains a character that cannot be represented in the current code page (936). Save the file in Unicode format to prevent data loss
24>f:\arcemu-arcemu-5f9054b\arcemu-arcemu-5f9054b\src\arcemu-shared\MersenneTwister.h : warning C4819: The file contains a character that cannot be represented in the current code page (936). Save the file in Unicode format to prevent data loss
24>f:\arcemu-arcemu-5f9054b\arcemu-arcemu-5f9054b\src\arcemu-world\../arcemu-shared/MersenneTwister.h : warning C4819: The file contains a character that cannot be represented in the current code page (936). Save the file in Unicode format to prevent data loss
21>     Creating library F:/build/scripts/serverstatusplugin/Debug/ServerStatusPlugin.lib and object F:/build/scripts/serverstatusplugin/Debug/ServerStatusPlugin.exp
21>     Creating library F:/build/scripts/serverstatusplugin/Debug/ServerStatusPlugin.lib and object F:/build/scripts/serverstatusplugin/Debug/ServerStatusPlugin.exp
21>  ServerStatusPlugin.vcxproj -> F:\build\scripts\serverstatusplugin\Debug\ServerStatusPlugin.dll
26>------ Rebuild All started: Project: Battlegrounds, Configuration: Debug Win32 ------
26>  Building Custom Rule F:/arcemu-arcemu-5f9054b/arcemu-arcemu-5f9054b/cmake/battlegrounds/CMakeLists.txt
26>  CMake does not need to re-run because F:\build\battlegrounds\CMakeFiles\generate.stamp is up-to-date.
26>  Setup.cpp
26>f:\arcemu-arcemu-5f9054b\arcemu-arcemu-5f9054b\src\arcemu-shared\MersenneTwister.h : warning C4819: The file contains a character that cannot be represented in the current code page (936). Save the file in Unicode format to prevent data loss
26>f:\arcemu-arcemu-5f9054b\arcemu-arcemu-5f9054b\src\arcemu-world\../arcemu-shared/MersenneTwister.h : warning C4819: The file contains a character that cannot be represented in the current code page (936). Save the file in Unicode format to prevent data loss
24>     Creating library F:/build/scripts/luaengine/Debug/LuaEngine.lib and object F:/build/scripts/luaengine/Debug/LuaEngine.exp
24>     Creating library F:/build/scripts/luaengine/Debug/LuaEngine.lib and object F:/build/scripts/luaengine/Debug/LuaEngine.exp
24>  LuaEngine.vcxproj -> F:\build\scripts\luaengine\Debug\LuaEngine.dll
27>------ Rebuild All started: Project: GossipScripts, Configuration: Debug Win32 ------
27>  Building Custom Rule F:/arcemu-arcemu-5f9054b/arcemu-arcemu-5f9054b/cmake/scripts/gossipscripts/CMakeLists.txt
27>  CMake does not need to re-run because F:\build\scripts\gossipscripts\CMakeFiles\generate.stamp is up-to-date.
27>  Setup.cpp
27>f:\arcemu-arcemu-5f9054b\arcemu-arcemu-5f9054b\src\arcemu-shared\MersenneTwister.h : warning C4819: The file contains a character that cannot be represented in the current code page (936). Save the file in Unicode format to prevent data loss
27>f:\arcemu-arcemu-5f9054b\arcemu-arcemu-5f9054b\src\arcemu-world\../arcemu-shared/MersenneTwister.h : warning C4819: The file contains a character that cannot be represented in the current code page (936). Save the file in Unicode format to prevent data loss
23>  Creatures.cpp
23>  DarkmoonFaireObjects.cpp
23>  GameObjects.cpp
23>  GameObjectTeleportTable.cpp
25>  Instance_Arcatraz.cpp
23>  RandomScripts.cpp
25>  Instance_AuchenaiCrypts.cpp
25>  Instance_AzjolNerub.cpp
25>  Instance_BlackfathomDeeps.cpp
25>  Instance_BlackMorass.cpp
25>  Instance_BlackrockDepths.cpp
25>  Instance_BlackrockSpire.cpp
25>  Instance_BloodFurnace.cpp
25>  Instance_Botanica.cpp
25>  Instance_CullingOfStratholme.cpp
25>  Instance_Deadmines.cpp
25>  Instance_DireMaul.cpp
25>  Instance_DrakTharonKeep.cpp
25>  Instance_Gundrak.cpp
25>  Instance_HallsOfLightning.cpp
25>  Instance_HellfireRamparts.cpp
25>  Instance_MagistersTerrace.cpp
25>  Instance_ManaTombs.cpp
25>  Instance_Mauradon.cpp
25>  Instance_Nexus.cpp
25>  Instance_OldHillsbradFoothills.cpp
25>  Instance_HallsOfStone.cpp
25>  Instance_RagefireChasm.cpp
25>  Instance_RazorfenDowns.cpp
25>  Instance_ScarletMonastery.cpp
25>  Instance_Scholomance.cpp
25>  Instance_SethekkHalls.cpp
25>  Instance_ShadowLabyrinth.cpp
25>  Instance_ShadowfangKeep.cpp
25>  Instance_TheMechanar.cpp
25>  Instance_TheShatteredHalls.cpp
25>  Instance_TheSlavePens.cpp
25>  Instance_TheSteamvault.cpp
25>  Instance_TheUnderbog.cpp
25>  Instance_Uldaman.cpp
25>  Instance_UtgardeKeep.cpp
22>  Base.cpp
25>  Instance_WailingCaverns.cpp
22>  Quest_ArathiHighlands.cpp
22>  Quest_Azshara.cpp
22>  Quest_Azuremyst_Isle.cpp
22>  Quest_BladeEdge_Mountains.cpp
25>  Instance_TheStockade.cpp
22>  Quest_BlastedLands.cpp
25>  Instance_ZulFarrak.cpp
22>  Quest_BloodmystIsle.cpp
22>  Quest_BoreanTundra.cpp
25>  Raid_BlackTemple.cpp
25>  Raid_BlackwingLair.cpp
25>  Raid_CoT_BattleOfMountHyjal.cpp
23>     Creating library F:/build/scripts/miscscripts/Debug/MiscScripts.lib and object F:/build/scripts/miscscripts/Debug/MiscScripts.exp
22>  Quest_BurningSteppes.cpp
22>  Quest_Darkshore.cpp
25>  Raid_GruulsLair.cpp
22>  Quest_DeathKnight.cpp
22>  Quest_Desolace.cpp
22>  Quest_Dragonblight.cpp
22>  Quest_Druid.cpp
25>  Raid_Karazhan.cpp
25>  Raid_MoltenCore.cpp
22>  Quest_Duskwood.cpp
22>  Quest_Dustwallow_Marsh.cpp
22>  Quest_Eastern_Plaguelands.cpp
22>  Quest_EversongWoods.cpp
25>  Raid_Naxxramas.cpp
22>  Quest_FirstAid.cpp
22>  Quest_Ghostlands.cpp
22>  Quest_Hellfire_Peninsula.cpp
22>  Quest_HillsbradFoothills.cpp
22>  Quest_Isle_of_QuelDanas.cpp
22>  Quest_Howling_Fjord.cpp
22>  Quest_LochModan.cpp
22>  Quest_Mage.cpp
25>  Raid_OnyxiasLair.cpp
25>  Raid_SerpentshrineCavern.cpp
22>  Quest_Mulgore.cpp
22>  Quest_Nagrand.cpp
22>  Quest_Netherstorm.cpp
22>  Quest_Paladin.cpp
25>  Raid_TheEye.cpp
22>  QuestGossip.cpp
22>  QuestHooks.cpp
22>  Quest_RedridgeMountains.cpp
25>  Raid_TheObsidianSanctum.cpp
22>  Quest_ShadowMoon.cpp
22>  Quest_SholazarBasin.cpp
22>  Quest_Silithus.cpp
22>  Quest_SilvermoonCity.cpp
22>  Quest_Silverpine_Forest.cpp
25>  Raid_Ulduar.cpp
22>  Quest_Stormwind.cpp
22>  Quest_StranglethornVale.cpp
22>  Quest_Tanaris.cpp
22>  Quest_Teldrassil.cpp
22>  Quest_Terrokar_Forest.cpp
25>  Raid_ZulGurub.cpp
25>F:\arcemu-arcemu-5f9054b\arcemu-arcemu-5f9054b\src\scripts\src\InstanceScripts\Raid_ZulGurub.cpp : warning C4819: The file contains a character that cannot be represented in the current code page (936). Save the file in Unicode format to prevent data loss
25>F:\arcemu-arcemu-5f9054b\arcemu-arcemu-5f9054b\src\scripts\src\InstanceScripts\Raid_ZulGurub.cpp(351): error C2065: 'CN_VENOXIS' : undeclared identifier
25>F:\arcemu-arcemu-5f9054b\arcemu-arcemu-5f9054b\src\scripts\src\InstanceScripts\Raid_ZulGurub.cpp(351): error C2653: 'VenoxisAI' : is not a class or namespace name
25>F:\arcemu-arcemu-5f9054b\arcemu-arcemu-5f9054b\src\scripts\src\InstanceScripts\Raid_ZulGurub.cpp(351): error C2065: 'Create' : undeclared identifier
22>  Quest_The_Barrens.cpp
22>  Quest_TheStormPeaks.cpp
25>  Raid_Magtheridons_Lair.cpp
22>  Quest_ThousandNeedles.cpp
22>  Quest_TirisfalGlades.cpp
22>  Quest_Undercity.cpp
22>  Quest_UnGoro.cpp
22>  Unsorted.cpp
22>  Quest_Warrior.cpp
22>  Quest_Westfall.cpp
25>  Raid_SunwellPlateau.cpp
22>  Quest_Winterspring.cpp
22>  Quest_Zangarmarsh.cpp
25>  Raid_WorldBosses.cpp
25>  Raid_ZulAman.cpp
25>  Instance_Base.cpp
25>  Base.cpp
22>     Creating library F:/build/scripts/questscripts/Debug/QuestScripts.lib and object F:/build/scripts/questscripts/Debug/QuestScripts.exp
23>     Creating library F:/build/scripts/miscscripts/Debug/MiscScripts.lib and object F:/build/scripts/miscscripts/Debug/MiscScripts.exp
23>  MiscScripts.vcxproj -> F:\build\scripts\miscscripts\Debug\MiscScripts.dll
28>------ Rebuild All started: Project: ExtraScripts, Configuration: Debug Win32 ------
29>------ Rebuild All started: Project: EventScripts, Configuration: Debug Win32 ------
28>  Building Custom Rule F:/arcemu-arcemu-5f9054b/arcemu-arcemu-5f9054b/cmake/scripts/extrascripts/CMakeLists.txt
22>     Creating library F:/build/scripts/questscripts/Debug/QuestScripts.lib and object F:/build/scripts/questscripts/Debug/QuestScripts.exp
28>  CMake does not need to re-run because F:\build\scripts\extrascripts\CMakeFiles\generate.stamp is up-to-date.
29>  Building Custom Rule F:/arcemu-arcemu-5f9054b/arcemu-arcemu-5f9054b/cmake/scripts/eventscripts/CMakeLists.txt
29>  CMake does not need to re-run because F:\build\scripts\eventscripts\CMakeFiles\generate.stamp is up-to-date.
28>  Setup.cpp
29>  Setup.cpp
22>  QuestScripts.vcxproj -> F:\build\scripts\questscripts\Debug\QuestScripts.dll
28>f:\arcemu-arcemu-5f9054b\arcemu-arcemu-5f9054b\src\arcemu-shared\MersenneTwister.h : warning C4819: The file contains a character that cannot be represented in the current code page (936). Save the file in Unicode format to prevent data loss
28>f:\arcemu-arcemu-5f9054b\arcemu-arcemu-5f9054b\src\arcemu-world\../arcemu-shared/MersenneTwister.h : warning C4819: The file contains a character that cannot be represented in the current code page (936). Save the file in Unicode format to prevent data loss
29>f:\arcemu-arcemu-5f9054b\arcemu-arcemu-5f9054b\src\arcemu-shared\MersenneTwister.h : warning C4819: The file contains a character that cannot be represented in the current code page (936). Save the file in Unicode format to prevent data loss
29>f:\arcemu-arcemu-5f9054b\arcemu-arcemu-5f9054b\src\arcemu-world\../arcemu-shared/MersenneTwister.h : warning C4819: The file contains a character that cannot be represented in the current code page (936). Save the file in Unicode format to prevent data loss
20>  DeathKnightSpells.cpp
20>  DruidSpells.cpp
20>  HunterSpells.cpp
20>  ItemSpells_1.cpp
20>  MageSpells.cpp
20>  PaladinSpells.cpp
20>  PetAISpells.cpp
20>  PriestSpells.cpp
20>  QIspells.cpp
20>  RogueSpells.cpp
20>  ShamanSpells.cpp
20>  WarlockSpells.cpp
20>  WarriorSpells.cpp
20>  MiscSpells.cpp
26>  AlteracValley.cpp
26>  ArathiBasin.cpp
26>  CircleOfBlood.cpp
26>  DalaranSewers.cpp
26>  EyeOfTheStorm.cpp
26>  IsleOfConquest.cpp
26>  RingOfTrials.cpp
26>  RingOfValor.cpp
26>  RuinsOfLordaeron.cpp
26>  StrandOfTheAncient.cpp
26>  WarsongGulch.cpp
20>     Creating library F:/build/spellhandlers/Debug/SpellHandlers.lib and object F:/build/spellhandlers/Debug/SpellHandlers.exp
20>     Creating library F:/build/spellhandlers/Debug/SpellHandlers.lib and object F:/build/spellhandlers/Debug/SpellHandlers.exp
20>  SpellHandlers.vcxproj -> F:\build\spellhandlers\Debug\SpellHandlers.dll
26>     Creating library F:/build/battlegrounds/Debug/Battlegrounds.lib and object F:/build/battlegrounds/Debug/Battlegrounds.exp
26>     Creating library F:/build/battlegrounds/Debug/Battlegrounds.lib and object F:/build/battlegrounds/Debug/Battlegrounds.exp
26>  Battlegrounds.vcxproj -> F:\build\battlegrounds\Debug\Battlegrounds.dll
27>  Gossip_Innkeepers.cpp
27>  Gossip_Guard.cpp
27>  Gossip_Trainer.cpp
27>  Gossip_Mulgore.cpp
27>  Gossip_Shattrath.cpp
27>  Gossip_Tanaris.cpp
27>  Gossip_Stormwind.cpp
27>  Gossip_Moonglade.cpp
27>  Gossip_DarkmoonFaire.cpp
27>  Gossip_Theramore.cpp
27>  Gossip_Teldrassil.cpp
27>  Gossip_BoreanTundra.cpp
27>  Gossip_WyrmrestTemple.cpp
27>  Gossip_XpEliminator.cpp
27>     Creating library F:/build/scripts/gossipscripts/Debug/GossipScripts.lib and object F:/build/scripts/gossipscripts/Debug/GossipScripts.exp
27>     Creating library F:/build/scripts/gossipscripts/Debug/GossipScripts.lib and object F:/build/scripts/gossipscripts/Debug/GossipScripts.exp
27>  GossipScripts.vcxproj -> F:\build\scripts\gossipscripts\Debug\GossipScripts.dll
28>  NeutralGuards.cpp
29>  Event_Halloween.cpp
29>  Event_WinterVeil.cpp
29>  Base.cpp
28>     Creating library F:/build/scripts/extrascripts/Debug/ExtraScripts.lib and object F:/build/scripts/extrascripts/Debug/ExtraScripts.exp
28>     Creating library F:/build/scripts/extrascripts/Debug/ExtraScripts.lib and object F:/build/scripts/extrascripts/Debug/ExtraScripts.exp
29>     Creating library F:/build/scripts/eventscripts/Debug/EventScripts.lib and object F:/build/scripts/eventscripts/Debug/EventScripts.exp
28>  ExtraScripts.vcxproj -> F:\build\scripts\extrascripts\Debug\ExtraScripts.dll
29>     Creating library F:/build/scripts/eventscripts/Debug/EventScripts.lib and object F:/build/scripts/eventscripts/Debug/EventScripts.exp
29>  EventScripts.vcxproj -> F:\build\scripts\eventscripts\Debug\EventScripts.dll
30>------ Rebuild All started: Project: ALL_BUILD, Configuration: Debug Win32 ------
30>  Building Custom Rule F:/arcemu-arcemu-5f9054b/arcemu-arcemu-5f9054b/cmake/CMakeLists.txt
30>  CMake does not need to re-run because F:\build\CMakeFiles\generate.stamp is up-to-date.
30>  Build all projects
31>------ Skipped Rebuild All: Project: INSTALL, Configuration: Debug Win32 ------
31>Project not selected to build for this solution configuration 
========== Rebuild All: 29 succeeded, 1 failed, 1 skipped ==========


When I built the project for INSTALL part, the log shows below :
1>------ Build started: Project: ZERO_CHECK, Configuration: Debug Win32 ------
2>------ Build started: Project: InstanceScripts, Configuration: Debug Win32 ------
2>  Raid_ZulGurub.cpp
2>F:\arcemu-arcemu-5f9054b\arcemu-arcemu-5f9054b\src\scripts\src\InstanceScripts\Raid_ZulGurub.cpp : warning C4819: The file contains a character that cannot be represented in the current code page (936). Save the file in Unicode format to prevent data loss
2>F:\arcemu-arcemu-5f9054b\arcemu-arcemu-5f9054b\src\scripts\src\InstanceScripts\Raid_ZulGurub.cpp(351): error C2065: 'CN_VENOXIS' : undeclared identifier
2>F:\arcemu-arcemu-5f9054b\arcemu-arcemu-5f9054b\src\scripts\src\InstanceScripts\Raid_ZulGurub.cpp(351): error C2653: 'VenoxisAI' : is not a class or namespace name
2>F:\arcemu-arcemu-5f9054b\arcemu-arcemu-5f9054b\src\scripts\src\InstanceScripts\Raid_ZulGurub.cpp(351): error C2065: 'Create' : undeclared identifier
3>------ Build started: Project: ALL_BUILD, Configuration: Debug Win32 ------
3>  Build all projects
4>------ Build started: Project: INSTALL, Configuration: Debug Win32 ------
4>  -- Install configuration: "Debug"
4>  -- Up-to-date: C:/Program Files (x86)/Arcemu/./libmysql.dll
4>  -- Up-to-date: C:/Program Files (x86)/Arcemu/./libeay32.dll
4>  -- Installing: C:/Program Files (x86)/Arcemu/./logon.exe
4>  -- Installing: C:/Program Files (x86)/Arcemu/./world.exe
4>  -- Installing: C:/Program Files (x86)/Arcemu/modules/SpellHandlers.dll
4>  -- Installing: C:/Program Files (x86)/Arcemu/modules/Battlegrounds.dll
4>  -- Installing: C:/Program Files (x86)/Arcemu/modules/EventScripts.dll
4>  CMake Error at scripts/instancescripts/cmake_install.cmake:32 (FILE):
4>    file INSTALL cannot find
4>    "F:/build/scripts/instancescripts/Debug/InstanceScripts.dll".
4>  Call Stack (most recent call first):
4>    scripts/cmake_install.cmake:33 (INCLUDE)
4>    cmake_install.cmake:50 (INCLUDE)
4>  
4>  
4>C:\Program Files (x86)\MSBuild\Microsoft.Cpp\v4.0\Microsoft.CppCommon.targets(113,5): error MSB3073: The command "setlocal
4>C:\Program Files (x86)\MSBuild\Microsoft.Cpp\v4.0\Microsoft.CppCommon.targets(113,5): error MSB3073: "C:\Program Files (x86)\CMake 2.8\bin\cmake.exe" -DBUILD_TYPE=Debug -P cmake_install.cmake
4>C:\Program Files (x86)\MSBuild\Microsoft.Cpp\v4.0\Microsoft.CppCommon.targets(113,5): error MSB3073: if %errorlevel% neq 0 goto :cmEnd
4>C:\Program Files (x86)\MSBuild\Microsoft.Cpp\v4.0\Microsoft.CppCommon.targets(113,5): error MSB3073: :cmEnd
4>C:\Program Files (x86)\MSBuild\Microsoft.Cpp\v4.0\Microsoft.CppCommon.targets(113,5): error MSB3073: endlocal & call :cmErrorLevel %errorlevel% & goto :cmDone
4>C:\Program Files (x86)\MSBuild\Microsoft.Cpp\v4.0\Microsoft.CppCommon.targets(113,5): error MSB3073: :cmErrorLevel
4>C:\Program Files (x86)\MSBuild\Microsoft.Cpp\v4.0\Microsoft.CppCommon.targets(113,5): error MSB3073: exit /b %1
4>C:\Program Files (x86)\MSBuild\Microsoft.Cpp\v4.0\Microsoft.CppCommon.targets(113,5): error MSB3073: :cmDone
4>C:\Program Files (x86)\MSBuild\Microsoft.Cpp\v4.0\Microsoft.CppCommon.targets(113,5): error MSB3073: if %errorlevel% neq 0 goto :VCEnd
4>C:\Program Files (x86)\MSBuild\Microsoft.Cpp\v4.0\Microsoft.CppCommon.targets(113,5): error MSB3073: :VCEnd" exited with code 1.
========== Build: 2 succeeded, 2 failed, 27 up-to-date, 0 skipped ==========



Any idea how to solve this ?

Guys,

I'm still having same problem ! I'm stuck for this one.
0

#2 User is offline   dfighter 

  • Titles are overrated
  • PipPipPipPipPipPipPipPipPipPip
  • Group: Administrator
  • Posts: 5,189
  • Joined: 14-June 08
  • IRC:dfighter
  • Gender:Male
  • Server OS:Linux

Posted 04 June 2012 - 10:18 PM

Have you changed something in the code?
Because that error should not be happening.
It doesn't happen with me...
"The demand for free goods is infinite."
0

#3 User is offline   Linspire 

  • Newbie
  • Group: Members
  • Posts: 4
  • Joined: 29-May 12
  • Gender:Male
  • Server OS:Windows

Posted 04 June 2012 - 11:28 PM

I didnt write/change anything on the code.
I follow exactly same as wiki stated steps.

I'm still stuck at this moment.
0

#4 User is offline   dfighter 

  • Titles are overrated
  • PipPipPipPipPipPipPipPipPipPip
  • Group: Administrator
  • Posts: 5,189
  • Joined: 14-June 08
  • IRC:dfighter
  • Gender:Male
  • Server OS:Linux

Posted 05 June 2012 - 06:15 PM

View PostLinspire, on 04 June 2012 - 11:28 PM, said:

I didnt write/change anything on the code.
I follow exactly same as wiki stated steps.

I'm still stuck at this moment.

That's weird. Because the errors it shows make no sense, since you have those in the files, and included.
Could it be that those character warnings are somehow related to it?
"The demand for free goods is infinite."
0

#5 User is offline   Linspire 

  • Newbie
  • Group: Members
  • Posts: 4
  • Joined: 29-May 12
  • Gender:Male
  • Server OS:Windows

Posted 05 June 2012 - 07:29 PM

Well perhaps,you can show me alternative download link codes or yours working codes so that I can try from beginning steps again.
0

#6 User is offline   dfighter 

  • Titles are overrated
  • PipPipPipPipPipPipPipPipPipPip
  • Group: Administrator
  • Posts: 5,189
  • Joined: 14-June 08
  • IRC:dfighter
  • Gender:Male
  • Server OS:Linux

Posted 05 June 2012 - 11:30 PM

View PostLinspire, on 05 June 2012 - 07:29 PM, said:

Well perhaps,you can show me alternative download link codes or yours working codes so that I can try from beginning steps again.

There's not a link for "downloading", we use the GIT version control system.
http://www.arcemu.or...the_source_code
"The demand for free goods is infinite."
0

#7 User is offline   Linspire 

  • Newbie
  • Group: Members
  • Posts: 4
  • Joined: 29-May 12
  • Gender:Male
  • Server OS:Windows

Posted 05 June 2012 - 11:58 PM

Yeah, I know in the wiki there use GIT version. All the codes are from the GIT.
Any other alternative solutions ?
0

#8 User is offline   dfighter 

  • Titles are overrated
  • PipPipPipPipPipPipPipPipPipPip
  • Group: Administrator
  • Posts: 5,189
  • Joined: 14-June 08
  • IRC:dfighter
  • Gender:Male
  • Server OS:Linux

Posted 07 June 2012 - 06:07 PM

View PostLinspire, on 05 June 2012 - 11:58 PM, said:

Yeah, I know in the wiki there use GIT version. All the codes are from the GIT.
Any other alternative solutions ?

No, github is more than enough.
Unfortunately I have no idea what could be wrong in your case.
"The demand for free goods is infinite."
1

Share this topic:


Page 1 of 1
  • You cannot start a new topic
  • You cannot reply to this topic

1 User(s) are reading this topic
0 members, 1 guests, 0 anonymous users